program: Gaussian 09
title: 000241088
version: EM64L-G09RevD.01
frameworkgroup: C1[X(C9H12Cl2O4)]
method: RPBEPBE
basis: SDD
operation: Freq
keyword: #p
keyword: freq=noraman
keyword: PBEPBE/SDD
title: #p freq=noraman PBEPBE/SDD
converged: YES YES NO NO
title: Mulliken charges:
elementType: Cl Cl O O O O C C C C C C C C C H H H H H H H H H H H H
charge: -0.062919 -0.063398 -0.265952 -0.281353 -0.226931 -0.247193 -0.625231 0.427561 0.291023 -0.230682 0.167062 -0.209504 -0.546680 -0.573160 -0.655318 0.243473 0.272209 0.229043 0.271220 0.264529 0.235561 0.261794 0.282714 0.257082 0.290537 0.232967 0.261543
chargesum: 0.00000
title: Mulliken charges with hydrogens summed into heavy atoms:
elementType: Cl Cl O O O O C C C C C C C C C
charge: -0.062919 -0.063398 -0.265952 -0.281353 -0.226931 -0.247193 -0.109548 0.427561 0.291023 0.269581 0.167062 0.290586 -0.002172 -0.025540 -0.160807
polarizability: 1.34897610e+02 1.44055388e+01 1.38283720e+02 4.80852995e+00 -8.08533437e+00 1.05093495e+02
1716.lowfreq: -18.1749 -5.7144 0.0009 0.0017 0.0025 5.9091 8.3333 15.5271 28.5816
frequency: -14.9990 15.3395 28.4138 43.7454 53.9288 57.3851 61.0248 104.4720 132.5829 159.4873 181.9026 208.4438 260.5980 292.7180 303.8733 323.7629 367.4408 393.8307 431.2979 443.5414 492.1650 536.1258 599.1990 605.0466 612.1846 615.3792 720.8811 779.4957 782.5162 811.0267 857.5407 890.3375 929.4803 937.3783 945.0173 969.6488 991.1488 993.9051 1004.9195 1077.3020 1082.0088 1093.2762 1120.1324 1180.2529 1184.4753 1185.8629 1222.8191 1226.7134 1292.8540 1297.1552 1303.7729 1319.2103 1356.0211 1360.5939 1416.7839 1431.2934 1438.9774 1440.6988 1456.6877 1457.3370 1629.1037 1661.4448 1663.6172 2998.4053 3000.0441 3009.5210 3061.1963 3061.7458 3080.3772 3081.5071 3083.9988 3106.7571 3147.0228 3147.6753 3218.6596
redmass: 6.3988 7.9248 13.1274 7.6793 11.3552 6.7926 9.4302 3.8248 4.0915 3.7331 4.5990 6.4022 2.4088 2.6684 3.9010 3.6993 3.4956 4.1486 3.0673 3.5129 3.6200 4.0919 5.0610 4.3763 3.6010 2.3364 3.4353 3.6792 2.0837 2.9905 3.3887 3.0714 1.9517 2.1970 2.1181 1.9149 1.9675 1.9544 1.3985 2.2011 2.2977 3.5847 4.9270 1.2608 1.2706 1.2752 1.1547 1.1339 1.8504 1.2694 1.2233 1.7945 1.4221 1.5203 1.1504 1.1030 1.1178 1.1084 1.0797 1.0796 11.2673 6.0325 9.0914 1.0606 1.0608 1.0626 1.0592 1.0601 1.0975 1.1001 1.1009 1.0626 1.1099 1.1098 1.1156
irintensity: 1.5485 1.9376 0.8064 1.5965 0.6554 2.2447 2.9361 5.5192 1.9818 1.9792 6.5940 1.2170 1.0886 3.1984 10.7947 10.0828 2.7555 12.8042 12.5350 6.7001 2.9476 7.8589 28.6560 17.6630 9.0373 3.1444 23.2550 3.2397 8.6066 4.5013 6.4373 6.6195 9.6081 19.5972 12.3494 18.5953 23.7517 35.6336 66.8076 1.2566 5.2311 155.0750 592.6251 0.6460 3.5972 5.8362 3.5468 4.0212 30.2383 29.8218 10.4010 106.9694 13.6529 10.1693 23.8127 9.0322 36.5088 14.6286 16.7384 26.6870 162.3334 43.1145 115.3403 32.4145 19.3825 8.1464 14.3227 22.5049 2.7272 4.5841 5.6353 4.4506 5.1826 7.9294 3.4179
temp: 298.150 k
press: 1.00000 atm
elementType: 17 17 8 8 8 8 6 6 6 6 6 6 6 6 6 1 1 1 1 1 1 1 1 1 1 1 1
symmnumber: 1
zpe: 525355.0 jmol-1
zpe.correction: 0.200097 hartree
zpe.thermalcorrener: 0.216213 hartree
zpe.thermalcorrenthalpy: 0.217157 hartree
zpe.thermalcorrgfe: 0.152453 hartree
zpe.sumelectzpe: -1569.995727 hartree
zpe.sumelectthermal: -1569.979612 hartree
zpe.sumelectthermalent: -1569.978667 hartree
zpe.sumelectthermalfe: -1570.043371 hartree
dipole: 4.3904 -0.8635 1.7514
dipole: 4.8051
quadrupole: -94.9679 -98.3489 -104.2834
quadrupole: 1.1511 3.2368 -13.5229
quadrupole: 4.2321 0.8512 -5.0833 1.1511 3.2368 -13.5229
hfenergy: -1570.1958246 hartree
pointgroup: C01 [X(C9H12Cl2O4)]
dipole: 1.6553295 -0.8971599 0.1697898 debye
polarizability: 142.5571538|11.1539452|132.6801344|-5.1080484|-7.487454|103.0375373 unknown
InChI: InChI=1S/C9H12Cl2O4/c1-7(9(13)15-5-3-11)6-8(12)14-4-2-10/h1-6H2
charge 0 multiplicity 1
27 atoms
Cl 2.974822 1.237511 -1.362295
Cl -0.598957 3.425056 1.877113
O  1.760648 -1.420091 0.246595
O  -0.975982 0.886775 -0.093217
O  0.18596 -1.957835 -1.397645
O  -3.254643 0.592694 -0.531184
C  -0.525466 -1.560131 0.949601
C  -1.932636 -1.203555 0.509127
C  0.453478 -1.662425 -0.216572
C  2.85878 -1.520263 -0.743181
C  -2.168684 0.149605 -0.092062
C  -1.019289 2.257469 -0.648584
C  3.762216 -0.307202 -0.60967
C  -0.016216 3.104597 0.111492
C  -2.997313 -2.036473 0.643345
H  -0.532207 -2.541388 1.461434
H  -0.126999 -0.818949 1.662655
H  3.437225 -2.429419 -0.487488
H  2.436119 -1.628086 -1.757224
H  -2.049516 2.648336 -0.587863
H  -0.716976 2.19298 -1.712146
H  4.702085 -0.452426 -1.164124
H  3.961576 -0.055643 0.441834
H  0.090974 4.096119 -0.354564
H  0.958804 2.604399 0.198088
H  -2.892317 -3.039346 1.070826
H  -3.992786 -1.717513 0.316308
