program: Gaussian 09
title: 000241072
version: EM64L-G09RevD.01
frameworkgroup: C1[X(C10H11IO2)]
method: RPBEPBE
basis: SDD
operation: Freq
keyword: #p
keyword: freq=noraman
keyword: PBEPBE/SDD
title: #p freq=noraman PBEPBE/SDD
converged: NO YES NO NO
title: Mulliken charges:
elementType: I O O C C C C C C C C C C H H H H H H H H H H H
charge: 0.076867 -0.267026 -0.262416 -0.574789 0.677586 -0.343164 0.196219 -0.517719 0.180862 -0.564775 -0.254575 -0.688399 -0.200740 0.230990 0.211883 0.210400 0.223036 0.263667 0.273283 0.219279 0.208614 0.222139 0.239275 0.239504
chargesum: 0.00000
title: Mulliken charges with hydrogens summed into heavy atoms:
elementType: I O O C C C C C C C C C C
charge: 0.076867 -0.267026 -0.262416 -0.131915 0.677586 0.090271 0.196219 -0.254052 0.180862 -0.564775 0.018707 -0.038367 0.278038
polarizability: 2.02920829e+02 -4.35025878e+00 1.36700882e+02 -2.98595709e+00 -8.33033077e+00 7.16142877e+01
1716.lowfreq: -61.3262 -7.1768 -1.5206 0.0002 0.0004 0.0007 7.3417 42.7176 67.4417
frequency: -61.2950 42.6343 67.4270 87.4876 99.9823 156.9549 199.2065 205.4884 231.7740 264.8094 286.8231 311.7173 354.7356 429.5618 459.2008 532.2763 628.2069 654.2157 679.4805 708.0291 742.0813 750.1317 788.9761 839.8115 855.1305 867.2018 869.1144 890.1638 933.8524 976.5449 1051.4591 1061.8366 1062.3111 1076.3938 1094.0231 1118.7763 1163.7605 1213.9412 1238.7095 1249.1738 1281.1546 1287.6369 1339.3613 1359.8188 1373.4903 1386.7924 1404.7242 1460.6407 1469.3774 1474.8783 1475.8825 1485.5578 1487.4367 1601.8583 1620.6124 2971.5770 2979.7934 2988.7663 3013.3284 3025.2544 3049.0749 3071.0438 3074.4700 3091.0238 3164.5405 3191.8582
redmass: 2.2950 3.8043 3.9845 2.2222 4.1002 6.4434 4.6858 3.8969 1.3897 5.8975 3.4850 3.0322 5.9673 3.3757 3.9597 5.1389 7.7178 8.6449 9.9441 4.3460 1.1939 3.9110 5.8180 8.3139 1.4142 1.4577 1.4739 1.6918 4.0082 5.3085 2.9416 2.9922 1.4636 1.6619 2.1534 1.0361 1.8634 1.4442 1.6204 2.9028 1.3697 1.1337 1.4433 1.5749 2.4352 1.2112 6.7463 2.8352 1.1058 1.0535 1.0515 1.1903 1.0880 8.5594 9.3534 1.0356 1.0597 1.0611 1.0535 1.0987 1.1024 1.1018 1.0992 1.1190 1.0927 1.0934
irintensity: 14.6226 0.0672 0.0460 0.0552 0.0178 0.2311 0.0619 0.3698 0.0944 0.1497 0.2087 1.5995 0.2709 12.3689 7.1627 8.7793 10.0837 5.6609 0.6007 0.5315 6.4298 1.8837 23.2705 29.5410 5.9411 29.1810 16.3484 5.5495 28.8102 137.4474 1.1667 26.0757 4.3302 40.9153 21.2930 0.0017 24.3796 1.2902 70.7293 116.7703 1.6656 0.2862 1.2376 6.7044 33.2030 11.0071 2.1426 244.0829 15.3766 9.5039 5.0526 14.9091 19.3163 1.2176 0.2093 39.7852 4.2246 56.2960 128.1651 0.5709 2.9477 69.0203 46.4362 31.9278 3.2338 1.4660
temp: 298.150 k
press: 1.00000 atm
elementType: 53 8 8 6 6 6 6 6 6 6 6 6 6 1 1 1 1 1 1 1 1 1 1 1
symmnumber: 1
zpe: 486720.8 jmol-1
zpe.correction: 0.185382 hartree
zpe.thermalcorrener: 0.197529 hartree
zpe.thermalcorrenthalpy: 0.198473 hartree
zpe.thermalcorrgfe: 0.144756 hartree
zpe.sumelectzpe: -548.623962 hartree
zpe.sumelectthermal: -548.611815 hartree
zpe.sumelectthermalent: -548.610871 hartree
zpe.sumelectthermalfe: -548.664589 hartree
dipole: -1.3724 1.2083 0.0604
dipole: 1.8295
quadrupole: -79.4116 -90.4736 -93.3894
quadrupole: 2.0989 -0.8520 -0.6616
quadrupole: 8.3466 -2.7154 -5.6312 2.0989 -0.8520 -0.6616
hfenergy: -548.8093445 hartree
pointgroup: C01 [X(C10H11I1O2)]
dipole: 0.3196875 -0.6437603 0.0383196 debye
dipolederiv: -0.2120647 0.2174583 -0.0024713 0.2279598 -0.2796175 0.0004649 0.007872 -0.0054806 -0.0122176 -1.379595 0.3848607 -0.0952023 0.4532566 -0.5969891 0.0068137 -0.1000232 0.0011458 -0.2650741 -1.4914196 0.2614303 -0.1164215 0.1823942 -0.4692234 -0.0109183 -0.1621065 0.0043346 -0.2662925 -0.067067 -0.0156562 0.0409988 -0.0589179 0.1249554 0.0142046 0.1732036 0.0935327 0.0743675 0.047198 0.2850177 0.0082417 0.239939 -0.2220453 0.0073599 0.0362317 0.0053209 -0.0338262 0.0485236 -0.0403849 -0.0198985 -0.0199984 0.1253692 -0.0003706 -0.1558045 -0.0850759 0.0846322 0.7412444 -0.3828753 0.0332861 -0.9587536 0.4412058 -0.0674878 -0.0521697 0.0051256 0.0533529 -0.1111665 -0.0197515 0.0261532 0.0484228 0.0092799 0.0356636 0.0207055 0.0186523 -0.1597192 1.1693039 -0.1398029 0.1314885 0.3588037 -0.107885 0.0286957 0.2309787 -0.0437159 0.0578317 0.2874968 -0.4704475 0.0229782 -0.6353857 0.6464961 0.0171865 -0.0385942 0.0655453 -0.1956743 -0.2131208 0.0292834 -0.0071081 0.2860109 -0.15096 0.0364764 0.0294701 -0.0086969 -0.0915995 -0.0712788 -0.0508571 0.0048601 -0.0545498 0.0856616 0.010241 0.08337 0.051809 0.0621363 1.2168675 -0.2140309 0.053615 -0.212209 0.5900941 -0.0207706 0.0674118 -0.0297211 0.5759585 -0.0168298 0.0365502 -0.0527525 0.0685671 0.0004536 0.1035126 -0.030864 0.0550205 0.0272358 0.0396002 0.003549 0.0169971 -0.0365272 -0.0920333 -0.1384115 -0.0108322 -0.0830552 -0.018849 -0.028077 0.0931549 -0.0627938 0.0701091 -0.0450763 0.1088189 -0.0386462 0.0654314 0.006074 0.0427355 -0.0267214 -0.0076428 -0.0134275 -0.0508392 -0.1317915 -0.0222925 -0.0878728 -0.0224375 0.0804631 -0.0206852 -0.0265479 -0.0163988 -0.0429691 -0.0330979 -0.0239939 -0.0356336 0.1539687 0.0979676 -0.0311586 -0.0160641 -0.040665 0.0118366 -0.0296076 -0.019441 -0.0298917 0.1698551 0.0162765 0.0543276 -0.0514422 0.1198287 -0.0602534 0.0946986 -0.0910917 0.073957 0.0363495 0.0606348 0.0163065 0.0093082 -0.0444595 -0.0814531 -0.1289423 -0.0515517 -0.146463 -0.0095246 -0.0556374 -0.0653364 0.1006957 -0.0594506 0.0723313 0.0482429 0.1436518 0.063725 -0.0961224 -0.0665082 0.0495396 -0.0535106 0.0703832 0.0343337 0.0459984 -0.1578679 0.0763574 -0.0879817 -0.1355471 0.0462298 0.0632331 0.025068 0.0573276 0.0030205 0.1623841 -0.0243506 -0.0424438 unknown
polarizability: 190.3338908|-26.1946959|149.4769521|6.9095271|4.8662557|71.4251554 unknown
InChI: InChI=1S/C10H11IO2/c1-2-3-7-4-9-10(5-8(7)11)13-6-12-9/h4-5H,2-3,6H2,1H3
charge 0 multiplicity 1
24 atoms
I  -1.927692 2.864012 -0.090769
O  2.547091 -1.614123 -0.102003
O  3.183941 0.660614 0.356027
C  -2.351047 -0.498809 -0.654967
C  -0.908137 -0.09102 -0.403019
C  -3.116589 -0.83936 0.654474
C  1.415385 -0.763987 -0.140759
C  0.094395 -1.114403 -0.407821
C  1.789107 0.568305 0.127676
C  -0.497243 1.239392 -0.126935
C  0.853687 1.601894 0.142231
C  -4.582965 -1.23506 0.383684
C  3.701166 -0.72852 0.217475
H  -2.891961 0.310106 -1.181107
H  -2.371656 -1.385385 -1.318052
H  -2.591117 -1.663095 1.17697
H  -3.083339 0.036196 1.331147
H  -0.185456 -2.149955 -0.621503
H  1.146472 2.633257 0.346516
H  -5.131115 -0.40972 -0.108754
H  -4.644433 -2.121288 -0.276503
H  -5.110441 -1.477003 1.324315
H  4.142138 -1.04579 1.178224
H  4.42171 -0.76226 -0.617846
