program: Gaussian 09
title: 000241075
version: EM64L-G09RevD.01
frameworkgroup: C1[X(C14H20O4)]
method: RPBEPBE
basis: SDD
operation: Freq
keyword: #pfreq=noraman
keyword: PBEPBE/SDD
title: #p freq=noraman PBEPBE/SDD
converged: YES YES NO NO
title: Mulliken charges:
elementType: O O O O C C C C C C C C C C C C C C H H H H H H H H H H H H H H H H H H H H
charge: -0.264383 -0.307062 -0.300531 -0.240934 -0.043974 -0.296355 -0.696400 -0.697675 -0.659385 0.479005 0.281407 -0.506775 -0.385335 0.228484 0.181369 -0.337787 -0.529880 -0.530603 0.210481 0.216536 0.233191 0.211220 0.211747 0.245238 0.221780 0.212250 0.212645 0.239649 0.236411 0.267229 0.244191 0.249479 0.251482 0.226624 0.229680 0.255164 0.222527 0.229290
chargesum: 0.00000
title: Mulliken charges with hydrogens summed into heavy atoms:
elementType: O O O O C C C C C C C C C C C C C C
charge: -0.264383 -0.307062 -0.300531 -0.240934 0.166507 0.153372 -0.028195 -0.051000 -0.183326 0.479005 0.281407 -0.239547 -0.141144 0.228484 0.181369 -0.088308 0.177905 0.176378
polarizability: 2.07735357e+02 -1.49713619e+01 1.42778782e+02 1.40680879e+01 1.03582468e+01 1.47104745e+02
1716.lowfreq: -8.4624 -0.0008 -0.0005 -0.0004 5.5751 8.8252 15.4384 23.4283 30.5063
frequency: 10.7887 14.7454 30.3549 52.9331 61.7212 74.2271 94.4971 106.4687 121.4349 152.4857 157.9475 166.7353 198.4543 218.1227 230.4169 243.6761 254.1830 277.3190 297.7421 322.1756 344.7859 371.5008 389.8076 409.2992 429.7089 473.6571 486.6418 497.6669 570.6901 599.7294 615.9323 691.4198 709.1954 741.7225 763.7476 802.6746 815.3243 844.0897 881.0514 895.1140 908.9624 923.7500 942.4148 945.0451 948.9993 955.4215 962.1612 968.7380 987.8614 1084.0380 1102.6190 1114.0063 1115.5354 1133.3681 1138.7701 1153.8571 1157.0688 1167.4696 1186.0797 1193.9989 1221.7244 1245.6122 1251.1370 1263.3281 1285.6328 1293.2761 1344.6052 1357.8437 1368.8516 1381.5145 1399.9261 1402.3928 1424.3363 1444.0848 1457.0894 1457.5595 1458.1666 1459.5104 1469.1756 1471.8181 1477.3719 1483.5123 1485.5689 1487.8246 1493.3648 1575.8664 1612.1574 1643.0581 2972.3953 2972.4984 2974.1316 2978.7710 2985.1709 3011.4743 3033.8890 3064.5677 3069.2616 3070.8245 3072.4600 3078.5362 3082.7645 3088.3841 3103.0605 3121.0459 3121.4176 3135.7334 3154.1291 3164.1270
redmass: 3.3931 4.2333 3.6946 6.8960 3.1008 3.4303 4.1432 2.8877 3.2356 1.2139 1.1455 2.5387 1.1291 2.7125 3.5653 1.4381 3.0387 4.6968 3.3375 2.4836 4.5048 3.7167 2.8735 1.8993 4.2504 3.9926 3.4002 4.6039 4.8338 4.8299 4.8376 5.5404 5.8749 3.6390 4.1062 3.2203 2.6678 1.7585 4.8977 1.7692 1.5846 1.1901 2.0375 4.1993 1.8552 1.4900 2.3570 2.1922 3.7070 2.2962 2.3144 1.2400 1.2435 2.2672 1.4924 1.3302 1.4823 1.8507 1.8104 1.8454 1.7176 2.5467 1.2238 1.7620 1.6178 1.3550 1.4213 1.3870 7.0107 1.2082 1.2139 2.1827 1.1779 1.3998 1.0546 1.1047 1.0895 1.0658 1.0544 1.0535 1.0706 1.0586 2.5797 1.0621 1.0505 7.4902 6.6682 9.3049 1.0319 1.0343 1.0310 1.0365 1.0833 1.0569 1.0585 1.0999 1.1038 1.1038 1.1004 1.0994 1.0994 1.1072 1.1046 1.1028 1.1029 1.0887 1.0922 1.0962
irintensity: 0.4453 0.2033 0.3108 2.0042 1.4141 0.7289 2.4420 8.0234 0.6279 0.9393 0.0884 5.2383 0.4591 4.8410 7.4678 1.6282 0.4851 9.1089 8.6281 0.9951 0.3457 0.2145 0.9943 1.5121 7.2530 7.2261 8.9283 13.2592 5.6022 6.8012 10.5403 6.0178 7.7874 9.8777 13.3343 17.4051 7.4625 26.0259 23.8293 10.6092 10.6653 6.2756 7.6258 72.4720 4.1418 11.4396 40.4770 33.9946 57.2833 145.1563 139.0692 12.5653 1.8343 2.0853 5.0378 0.6309 5.4447 0.2124 2.7259 64.6670 135.5478 111.0242 20.8104 36.4454 25.3511 1.5969 3.0181 7.0605 12.3484 16.2493 9.4151 18.3838 1.3073 15.8114 14.4103 28.4102 6.6006 3.1492 12.6810 9.2888 7.9344 9.4270 116.0288 35.3436 17.5243 11.5569 2.4017 162.8870 117.3890 11.8533 50.0763 17.4184 14.9884 45.3946 15.3356 27.8125 31.1730 21.2627 11.9640 53.8692 32.4946 31.5126 5.0993 23.9905 24.5899 7.9267 2.8713 6.0250
temp: 298.150 k
press: 1.00000 atm
elementType: 8 8 8 8 6 6 6 6 6 6 6 6 6 6 6 6 6 6 1 1 1 1 1 1 1 1 1 1 1 1 1 1 1 1 1 1 1 1
symmnumber: 1
zpe: 822320.8 jmol-1
zpe.correction: 0.313205 hartree
zpe.thermalcorrener: 0.333461 hartree
zpe.thermalcorrenthalpy: 0.334405 hartree
zpe.thermalcorrgfe: 0.261043 hartree
zpe.sumelectzpe: -844.965212 hartree
zpe.sumelectthermal: -844.944956 hartree
zpe.sumelectthermalent: -844.944012 hartree
zpe.sumelectthermalfe: -845.017374 hartree
dipole: -0.0493 -1.3829 -1.2000
dipole: 1.8316
quadrupole: -91.1012 -109.8060 -105.7884
quadrupole: 1.0212 4.1686 -5.2807
quadrupole: 11.1307 -7.5741 -3.5566 1.0212 4.1686 -5.2807
hfenergy: -845.278417 hartree
pointgroup: C01 [X(C14H20O4)]
dipole: -0.0792494 -0.6870195 0.2024978 debye
polarizability: 201.7429917|1.8693954|154.9391516|28.6292387|-3.3512012|140.9367409 unknown
InChI: InChI=1S/C14H20O4/c1-10(2)9-18-14(15)8-11-5-6-12(16-3)13(7-11)17-4/h5-7,10H,8-9H2,1-4H3
charge 0 multiplicity 1
38 atoms
O  -3.029157 0.124656 -1.732718
O  3.053143 1.469791 0.425502
O  3.131263 -1.371728 1.13904
O  -2.195271 2.268464 -1.292761
C  -4.289002 -0.49963 0.31987
C  -4.264194 0.392954 -0.93437
C  -3.12081 -0.171888 1.277037
C  -5.659657 -0.336941 1.021977
C  -0.836524 0.638503 -2.566322
C  0.222777 0.115929 -1.596016
C  -2.065114 1.134563 -1.805409
C  1.163727 1.002387 -1.019149
C  0.251993 -1.252254 -1.225542
C  2.128228 0.537104 -0.101835
C  2.182464 -0.848453 0.229115
C  1.228491 -1.728956 -0.324635
C  2.962615 1.661734 1.892459
C  4.543084 -1.239333 0.707124
H  -4.187715 -1.552181 -0.014757
H  -5.098956 0.150373 -1.614667
H  -4.288193 1.465876 -0.668107
H  -3.162143 -0.815444 2.174831
H  -3.168536 0.882792 1.608103
H  -2.142215 -0.333332 0.791329
H  -5.722076 -1.000446 1.903157
H  -6.499284 -0.589145 0.347068
H  -5.803162 0.702488 1.374409
H  -0.44007 1.49179 -3.141857
H  -1.145615 -0.156095 -3.264311
H  1.150333 2.071469 -1.256161
H  -0.483179 -1.945023 -1.650125
H  1.278911 -2.786104 -0.044742
H  3.110671 0.705808 2.426626
H  1.978346 2.09186 2.157427
H  3.762962 2.374121 2.144062
H  4.801267 -0.182745 0.514067
H  4.717274 -1.840519 -0.205403
H  5.141829 -1.639444 1.539488
