program: Gaussian 09
title: 000241066
version: EM64L-G09RevD.01
frameworkgroup: C1[X(C24H26O3)]
method: RPBEPBE
basis: SDD
operation: Freq
keyword: #pfreq=noraman
keyword: PBEPBE/SDD
title: #p freq=noraman PBEPBE/SDD
converged: YES YES NO NO
title: Mulliken charges:
elementType: O O O C C C C C C C C C C C C C C C C C C C C C C C C H H H H H H H H H H H H H H H H H H H H H H H H H H
charge: -0.475819 -0.526504 -0.445325 -0.784845 -0.695070 0.408171 0.346816 0.414496 0.375228 -0.064701 -0.399952 -0.375665 -0.000733 -0.062787 -0.527479 -0.519887 0.359971 0.364859 -0.269153 0.485530 0.492779 -0.628510 -0.641143 -0.872563 -0.877561 -0.821874 -0.828216 0.254310 0.226684 0.231779 0.231899 0.216424 0.257577 0.236803 0.270367 0.216617 0.238321 0.231628 0.253777 0.230423 0.238378 0.226388 0.233342 0.247900 0.228120 0.235279 0.222699 0.218210 0.228434 0.224512 0.415887 0.389686 0.364496
chargesum: 0.00000
title: Mulliken charges with hydrogens summed into heavy atoms:
elementType: O O O C C C C C C C C C C C C C C C C C C C C C C C C
charge: -0.059931 -0.136817 -0.080829 -0.303851 -0.231392 0.408171 0.346816 0.414496 0.375228 -0.064701 -0.183528 -0.118088 -0.000733 -0.062787 -0.290677 -0.249520 0.359971 0.364859 -0.052537 0.485530 0.492779 -0.390189 -0.409514 -0.149986 -0.169930 -0.135776 -0.157061
polarizability: 3.45009048e+02 2.59267558e+00 2.86908876e+02 -9.18425564e+00 -3.10280365e+00 1.84828721e+02
1716.lowfreq: -9.0977 -4.2735 -2.1206 -0.0002 0.0005 0.0010 11.0347 15.0416 21.2991
frequency: 9.5650 14.8699 20.9418 38.3782 43.8903 44.5071 54.0615 71.9154 105.7205 117.2252 128.9851 139.5441 152.2909 170.0808 175.6937 188.5145 207.7037 211.8323 222.1503 236.4393 264.2824 272.8432 279.9124 298.8483 303.4320 315.7460 325.4218 351.9547 354.6271 361.9777 382.7264 444.4983 456.5418 466.0144 470.5466 487.8889 492.0992 510.6509 522.1151 538.6674 544.9001 554.9663 561.6792 565.1300 567.1644 580.1817 626.7255 646.6346 691.1254 719.7892 733.3071 735.1788 744.0785 760.1506 771.3680 801.6608 825.0697 866.3321 868.2599 891.9621 901.8792 911.3878 916.3792 918.1898 929.4961 932.8250 954.4742 965.1155 970.2946 984.9904 1008.8708 1010.2717 1014.3076 1018.3918 1040.9399 1042.0604 1048.4594 1050.0019 1076.5483 1128.2681 1134.1954 1153.2008 1159.1494 1168.8232 1172.8850 1182.4302 1208.3156 1219.9981 1229.5137 1248.0542 1259.1096 1278.4194 1279.8000 1304.8350 1306.8217 1324.0716 1326.1105 1352.0169 1383.7326 1384.5143 1395.5715 1397.0438 1399.3833 1399.7297 1404.7471 1419.5816 1419.8906 1447.8467 1453.0261 1454.8081 1463.2874 1469.5502 1471.5181 1471.8270 1477.8408 1479.4645 1481.8728 1482.7534 1486.8199 1494.2911 1496.3470 1596.8329 1608.3833 1612.4930 1616.4198 1624.2254 1626.6765 2946.7271 2952.0034 2970.3429 2976.2619 3001.3029 3013.4542 3020.0080 3021.8074 3047.3499 3054.5919 3057.5947 3075.4687 3082.1885 3083.0662 3083.2595 3088.1268 3109.3063 3112.3798 3117.8832 3123.0926 3132.5346 3134.4867 3156.7417 3217.6776 3581.7699 3608.2950
redmass: 4.4392 4.5499 4.2123 4.5958 1.3114 2.3790 1.1068 3.5875 5.2528 3.7433 1.1282 4.1559 1.1849 3.2626 3.7278 3.6875 2.8130 3.0358 3.5232 3.9500 2.7038 2.7856 1.2471 4.4507 1.6845 3.2514 1.9861 3.7968 4.5332 2.6154 3.1859 5.4188 5.4718 4.4483 3.7897 3.2216 3.5404 3.8415 3.7855 3.8220 4.6394 3.7080 4.0830 3.6333 3.9232 4.5784 4.3067 4.7501 4.0639 1.6583 4.3823 4.5761 2.2003 1.7674 3.0418 2.7278 4.6153 1.3355 1.3617 1.9943 1.4497 2.1939 1.7034 1.5608 2.1702 2.1678 3.2259 1.4339 2.9156 2.5570 1.5899 1.5521 1.6394 1.8000 1.5034 1.5076 1.5416 1.5486 2.0782 3.0349 2.8348 1.4191 1.3991 1.2713 1.4683 1.2425 2.5903 1.7204 1.8074 1.9964 1.8717 1.3876 1.3609 1.3719 1.4208 6.5664 5.6720 1.6916 2.8753 3.8603 1.2465 1.5314 1.2536 1.3912 2.6040 2.7996 2.8736 2.2447 1.8139 1.9147 1.5937 1.0465 1.0472 1.4346 1.0446 1.0456 1.1724 1.1894 1.3306 1.4579 1.5067 6.2999 6.1845 6.1242 6.3598 6.4974 6.8280 1.0402 1.0404 1.0368 1.0373 1.0599 1.0977 1.0980 1.0586 1.0977 1.0976 1.1016 1.0986 1.1032 1.0943 1.0988 1.0941 1.0877 1.0913 1.0913 1.0920 1.0923 1.0900 1.0988 1.0706 1.0654 1.0655
irintensity: 0.4555 0.2915 0.4663 0.6950 0.8252 0.4312 1.0579 0.3031 2.9137 0.5281 0.1879 1.2535 0.0802 0.9453 2.6417 4.5904 2.0111 8.7333 3.0232 4.0599 1.2056 2.5992 103.9096 17.1231 61.6561 0.6983 41.4870 1.3632 0.2028 1.1534 3.2434 0.4128 3.8162 2.5728 1.5786 2.2225 4.5251 0.7416 1.4664 0.9017 3.8991 8.0951 7.7390 3.0526 4.1887 11.7008 0.8995 0.5054 8.2218 136.3319 20.8963 9.0082 46.0338 30.2416 2.8850 19.6309 12.1658 26.0611 14.4215 1.2070 2.4204 0.6003 6.0347 2.3787 16.2779 5.5686 7.6841 0.6365 11.7929 9.3733 0.7751 5.4979 6.3989 9.2686 2.0165 2.3787 16.0191 15.7177 32.2073 41.0257 66.7423 80.9694 83.5296 19.7849 20.2804 14.6029 46.0200 1.1107 3.3439 46.8207 10.2193 1.3813 47.9888 8.6526 1.6671 1.9672 0.2224 46.3330 0.8006 2.2507 2.7958 25.1797 4.1245 14.3016 65.7043 2.1631 0.0869 58.0671 37.3142 34.3245 0.6068 10.1522 10.8011 14.6828 15.0714 14.8922 10.1486 12.8769 8.1865 82.5694 24.1924 10.6112 5.7547 1.4328 1.8856 0.5921 4.1169 49.2760 34.5784 47.4603 40.2814 22.3596 24.7475 19.8618 20.3482 24.4777 20.5684 6.3384 23.8571 1.7547 16.1887 17.9449 16.1050 10.3724 27.0101 16.0781 16.0725 2.8402 15.4584 27.4971 970.0428 24.4919 46.2028
temp: 298.150 k
press: 1.00000 atm
elementType: 8 8 8 6 6 6 6 6 6 6 6 6 6 6 6 6 6 6 6 6 6 6 6 6 6 6 6 1 1 1 1 1 1 1 1 1 1 1 1 1 1 1 1 1 1 1 1 1 1 1 1 1 1
symmnumber: 1
zpe: 1137229.2 jmol-1
zpe.correction: 0.433148 hartree
zpe.thermalcorrener: 0.460301 hartree
zpe.thermalcorrenthalpy: 0.461245 hartree
zpe.thermalcorrgfe: 0.372816 hartree
zpe.sumelectzpe: -1153.900899 hartree
zpe.sumelectthermal: -1153.873745 hartree
zpe.sumelectthermalent: -1153.872801 hartree
zpe.sumelectthermalfe: -1153.961231 hartree
dipole: 2.6160 1.4189 -0.0856
dipole: 2.9773
quadrupole: -121.7936 -142.2800 -161.1380
quadrupole: 12.7133 -4.9894 -3.8949
quadrupole: 19.9436 -0.5428 -19.4008 12.7133 -4.9894 -3.8949
hfenergy: -1154.3340462 hartree
pointgroup: C01 [X(C24H26O3)]
dipole: -1.0842687 0.2781691 -0.3450001 debye
polarizability: 344.7692221|-6.4197109|218.4162935|-8.9221142|-47.9824375|253.561129 unknown
InChI: InChI=1S/C24H26O3/c1-14-8-16(3)22(25)20(10-14)12-18-6-5-7-19(24(18)27)13-21-11-15(2)9-17(4)23(21)26/h5-11,25-27H,12-13H2,1-4H3
charge 0 multiplicity 1
53 atoms
O  -0.251703 0.854837 -0.707249
O  -2.76441 0.994252 -1.661558
O  4.554495 0.514579 1.923914
C  -2.063199 -1.519257 -0.530734
C  1.998231 1.281901 0.94139
C  -0.860562 -1.284304 0.389236
C  1.103744 0.054367 1.106703
C  -3.335054 -0.77372 -0.120468
C  3.179282 1.031962 0.004816
C  -0.027724 -0.13308 0.261912
C  -0.541611 -2.238017 1.386561
C  1.385358 -0.921221 2.090433
C  -3.675733 0.474757 -0.691565
C  4.445224 0.64674 0.515356
C  -4.214124 -1.302274 0.852124
C  3.041773 1.163777 -1.395683
C  -4.845802 1.190442 -0.338645
C  5.555955 0.404959 -0.336057
C  0.57007 -2.065273 2.238311
C  -5.394532 -0.627013 1.249838
C  4.120882 0.927418 -2.28358
C  -5.693313 0.61481 0.638102
C  5.369135 0.552208 -1.731814
C  -5.165671 2.527956 -0.984644
C  6.900581 -0.002185 0.244103
C  -6.30818 -1.219304 2.30959
C  3.93684 1.070534 -3.78589
H  -1.804855 -1.258067 -1.574019
H  -2.286983 -2.601041 -0.520943
H  1.392673 2.109351 0.533806
H  2.382459 1.579247 1.931966
H  -1.171276 -3.132029 1.482348
H  2.262017 -0.77211 2.730714
H  -3.964494 -2.267168 1.311657
H  2.056637 1.444391 -1.787084
H  0.802727 -2.815501 3.001728
H  -6.604823 1.152187 0.927744
H  6.220421 0.366733 -2.39957
H  -6.117726 2.927808 -0.599023
H  -5.277151 2.449809 -2.085835
H  -4.389125 3.290996 -0.772862
H  7.309528 0.760333 0.939462
H  6.847371 -0.965575 0.791749
H  7.64571 -0.131182 -0.558357
H  -6.599878 -2.256151 2.059008
H  -5.808606 -1.252147 3.296504
H  -7.232763 -0.62773 2.423591
H  4.883009 0.897427 -4.328128
H  3.192462 0.347672 -4.171144
H  3.574946 2.081079 -4.054583
H  -1.167871 0.818626 -1.123934
H  -3.086958 1.846696 -2.040824
H  5.483694 0.287497 2.174729
