program: Gaussian 09
title: 000241008
version: EM64L-G09RevD.01
frameworkgroup: C1[X(C11H13NS)]
method: RPBEPBE
basis: SDD
operation: Freq
keyword: #p
keyword: freq=noraman
keyword: PBEPBE/SDD
title: #p freq=noraman PBEPBE/SDD
converged: YES YES NO NO
title: Mulliken charges:
elementType: S N C C C C C C C C C C C H H H H H H H H H H H H H
charge: 0.113574 0.008615 -0.362036 -0.360231 -0.486441 -0.669898 -0.334449 0.434055 -0.359976 -0.334934 -0.223756 -0.235181 -0.232811 0.272546 0.205036 0.234747 0.231482 0.220689 0.232848 0.213602 0.231116 0.274710 0.244333 0.227165 0.226569 0.228625
chargesum: 0.00000
title: Mulliken charges with hydrogens summed into heavy atoms:
elementType: S N C C C C C C C C C C C
charge: 0.113574 0.008615 -0.089490 0.079552 -0.034271 0.007669 -0.334449 0.434055 -0.085266 -0.090601 0.003409 -0.008612 -0.004185
polarizability: 2.14581586e+02 5.33153842e+00 1.47485821e+02 -4.58021476e+00 1.80018364e+00 7.29233774e+01
1716.lowfreq: -6.4464 -0.0017 -0.0011 0.0006 5.4577 11.2439 29.3304 42.6589 109.6303
frequency: 28.9485 42.5558 109.6218 124.9146 195.1471 225.0195 242.8706 267.6090 274.7330 356.9325 374.3927 401.3780 406.5676 448.0290 481.8053 573.8826 598.8077 610.7370 623.5910 657.2966 695.7341 777.3340 826.1136 852.1632 856.5769 880.6041 938.8284 949.7891 970.4979 986.6812 989.0839 1003.3206 1026.4807 1032.3024 1041.1797 1085.9401 1103.2895 1136.2645 1168.5096 1171.8839 1188.5533 1226.8004 1248.3690 1260.1691 1303.7032 1316.9854 1336.7693 1359.3278 1384.2519 1390.9794 1434.2668 1442.8649 1453.5707 1465.9221 1475.3474 1478.0973 1584.9964 1608.6606 1628.2148 2965.8591 2977.7191 2981.6354 3022.7159 3025.5190 3051.6314 3073.3086 3089.7602 3125.0575 3134.9044 3146.6522 3160.4298 3170.8341
redmass: 3.7715 5.1571 4.1497 4.2851 2.3674 1.0893 3.3920 4.4568 2.7176 5.2003 4.1682 2.8356 3.1020 4.1141 4.7521 3.4881 4.6818 5.7974 6.0949 4.2908 1.8424 1.8021 2.2081 2.5892 1.2496 6.5304 1.4314 1.3188 2.0441 1.4055 5.5662 1.3292 2.1464 2.1290 2.1454 1.6331 2.3139 1.7000 1.4062 1.0753 1.1211 2.1272 1.6110 1.2950 1.2481 1.3183 1.3136 1.4500 8.7960 1.2070 2.2371 1.0865 1.1120 1.0455 1.0473 2.2424 6.1118 6.0898 8.4441 1.0649 1.0383 1.0593 1.0876 1.0951 1.1003 1.0984 1.1002 1.0848 1.0884 1.0933 1.0970 1.0986
irintensity: 0.0451 1.2341 2.9589 1.9170 0.7639 0.0184 0.8504 1.0387 4.5805 9.9429 1.0718 0.0200 2.3289 2.1640 1.6512 9.0911 12.7508 6.9713 9.6945 19.6137 48.5281 56.8349 6.7518 1.8467 0.4693 140.1058 5.2601 4.5144 7.3670 0.5736 0.2470 1.1668 2.7120 11.7136 47.2674 5.0586 16.1012 3.3012 9.7672 0.0483 12.6760 27.6521 36.0959 28.6544 2.5704 3.1595 22.5882 15.2618 0.5577 17.5508 15.9096 10.3369 1.9750 15.8236 9.0267 12.4570 9.8003 3.0913 104.5632 37.9399 21.4847 58.1131 6.4268 34.4846 31.1238 29.5923 33.8459 0.5257 9.5611 25.8088 21.1628 19.2990
temp: 298.150 k
press: 1.00000 atm
elementType: 16 7 6 6 6 6 6 6 6 6 6 6 6 1 1 1 1 1 1 1 1 1 1 1 1 1
symmnumber: 1
zpe: 556570.3 jmol-1
zpe.correction: 0.211986 hartree
zpe.thermalcorrener: 0.224098 hartree
zpe.thermalcorrenthalpy: 0.225042 hartree
zpe.thermalcorrgfe: 0.172680 hartree
zpe.sumelectzpe: -878.825318 hartree
zpe.sumelectthermal: -878.813206 hartree
zpe.sumelectthermalent: -878.812262 hartree
zpe.sumelectthermalfe: -878.864625 hartree
dipole: 1.9289 0.3050 -0.1027
dipole: 1.9556
quadrupole: -66.6923 -82.0904 -88.3614
quadrupole: 3.4257 -1.6861 1.6574
quadrupole: 12.3557 -3.0423 -9.3134 3.4257 -1.6861 1.6574
hfenergy: -879.0373044 hartree
pointgroup: C01 [X(C11H13N1S1)]
dipole: 0.7637862 -0.088024 0.0288522 debye
dipolederiv: -0.5799484 -0.277488 0.0488829 -0.3942023 -0.5612088 0.0093113 0.0903776 0.0280305 -0.1096824 -0.6913787 -0.0020525 0.051067 -0.0215192 -1.0100467 0.101841 0.0342159 0.0736783 -0.2812964 0.6175281 0.0271567 0.0228584 -0.1025299 0.0273951 0.031784 0.0821993 0.0177274 0.1578524 -0.2116867 0.0124195 0.059555 -0.0569222 -0.1163812 0.0080402 0.004221 0.0222397 0.0724196 0.4026184 -0.1667452 -0.0341595 -0.0678027 0.356955 -0.0351461 -0.0773655 0.0117603 0.2580287 -0.0971534 -0.1083872 0.0454268 0.0368549 0.010187 0.0178027 -0.0396066 0.0035461 0.055826 1.1594608 0.2593698 -0.0334237 0.6362019 1.1407427 -0.1305649 -0.0956866 -0.0814996 0.0145681 -0.2448034 -0.0207894 -0.0038056 -0.1899517 -0.1088225 0.0114969 0.0195637 -0.0187826 0.0063058 -0.0731387 -0.0914769 -0.0069316 0.0824117 0.0255199 0.0235712 0.0030725 0.0087732 -0.1180956 -0.0199828 0.0714745 0.0289934 0.0039133 -0.0296006 0.0213516 0.0379697 0.0195741 -0.1331635 -0.0502865 0.1380576 0.0272947 0.1550713 0.0505684 0.0342471 0.019147 0.0283146 -0.150668 -0.116279 -0.0943321 -0.0119757 -0.1825297 0.1119103 0.0276818 -0.020294 0.029307 -0.1526859 0.0634561 -0.0145571 0.0095754 -0.0039657 -0.0236291 0.0169446 0.0122242 0.019604 -0.1526579 -0.0763436 -0.0198013 -0.0152592 0.0538106 0.0281485 0.0505556 -0.0471047 0.0088394 -0.1329158 -0.2043205 0.1073736 -0.0079961 0.1052357 0.063954 -0.0061767 -0.0035172 -0.0111272 0.0928847 0.1091485 -0.0127737 -0.0502435 -0.0304605 0.0465789 0.0473086 0.0108121 -0.0012084 -0.1217891 -0.0161532 0.033918 0.0062421 0.030799 -0.1245055 -0.0720969 0.0818686 -0.1309733 0.0496405 -0.073996 0.0912954 -0.0425418 -0.0212901 0.0923978 0.0150149 -0.0693705 0.0912793 -0.125012 0.1214813 0.0620026 0.0228972 -0.0305586 -0.1026896 -0.0734904 0.0121137 -0.0886139 0.0548681 -0.1982516 0.0070185 -0.0290419 0.0791705 0.0629806 0.0320736 -0.0212524 0.0313318 0.0911956 0.1105652 0.0131457 -0.0539524 -0.0143284 0.0869145 -0.0110316 0.0144235 0.0313481 -0.1284928 0.1394825 0.0829418 0.0089037 0.0385222 -0.0022015 -0.0249263 0.0210165 -0.0093495 0.1466295 0.0730724 -0.0981145 -0.0170388 -0.1171751 0.0188264 -0.0260797 -0.040506 -0.0146137 0.1443725 -0.0234483 -0.0963512 -0.0189499 -0.1188549 -0.0466726 -0.0318814 -0.0226068 -0.0322577 0.150202 0.0294201 0.0699634 0.0039434 0.1041973 -0.0889006 -0.02934 0.0057095 -0.0313182 0.153108 -0.1490626 0.0267321 -0.0103202 0.0259027 0.0915793 -0.0082912 -0.0116245 -0.00561 0.1585579 unknown
polarizability: 215.0158267|-2.4688715|147.1746374|2.2864465|1.6910899|72.8003207 unknown
InChI: InChI=1S/C11H13NS/c1-9-7-8-12-11(13-9)10-5-3-2-4-6-10/h2-6,9H,7-8H2,1H3
charge 0 multiplicity 1
26 atoms
S  1.342087 1.325718 -0.089603
N  0.815224 -1.461739 0.181699
C  3.096176 0.619905 0.217428
C  3.211623 -0.769763 -0.429958
C  2.247348 -1.80537 0.190326
C  4.096951 1.640036 -0.343618
C  0.336427 -0.262763 0.068189
C  -1.141952 -0.042027 0.029469
C  -1.994709 -1.166481 -0.153425
C  -1.724485 1.24501 0.169975
C  -3.393176 -1.00424 -0.197135
C  -3.126906 1.405138 0.123237
C  -3.966768 0.28351 -0.06087
H  3.200157 0.539112 1.31465
H  4.249841 -1.137378 -0.30323
H  3.023422 -0.676962 -1.516853
H  2.348554 -2.772129 -0.338021
H  2.533307 -2.001934 1.2452
H  3.959227 2.637025 0.111938
H  5.130982 1.306761 -0.132404
H  3.981355 1.742047 -1.437459
H  -1.531312 -2.152426 -0.254611
H  -1.086031 2.120449 0.331388
H  -4.037983 -1.878696 -0.340014
H  -3.562476 2.404148 0.235648
H  -5.054783 0.409547 -0.096549
