program: Gaussian 09
title: 000241006
version: EM64L-G09RevD.01
frameworkgroup: C1[X(C10H11NS)]
method: RPBEPBE
basis: SDD
operation: Freq
keyword: #p
keyword: freq=noraman
keyword: PBEPBE/SDD
title: #p freq=noraman PBEPBE/SDD
converged: YES YES NO NO
title: Mulliken charges:
elementType: S N C C C C C C C C C C H H H H H H H H H H H
charge: 0.135690 0.000364 -0.368637 -0.660094 -0.457303 -0.337786 0.438374 -0.360345 -0.334515 -0.223356 -0.234569 -0.232245 0.214106 0.238221 0.262350 0.265459 0.231959 0.220788 0.273760 0.244442 0.227463 0.226940 0.228935
chargesum: 0.00000
title: Mulliken charges with hydrogens summed into heavy atoms:
elementType: S N C C C C C C C C C C
charge: 0.135690 0.000364 0.083691 -0.132285 -0.004556 -0.337786 0.438374 -0.086586 -0.090073 0.004107 -0.007629 -0.003310
polarizability: 1.96517757e+02 -4.00260093e+00 1.34884535e+02 -3.73349208e+00 -7.43265450e-01 6.44083345e+01
1716.lowfreq: -15.8666 -6.9926 -2.2937 -0.0010 0.0010 0.0011 30.6429 54.0606 114.0340
frequency: 30.3279 53.9574 114.0292 142.4515 221.8227 275.7464 296.3745 334.7017 389.5571 401.7097 446.1213 469.0379 582.7468 600.8538 618.3139 622.1113 650.5318 696.0146 776.6147 831.4839 856.5191 858.1845 859.6698 910.0002 939.5990 986.5631 988.8399 993.6941 1002.6525 1027.1033 1038.0919 1075.0551 1089.9480 1153.3396 1171.5120 1181.3546 1189.4432 1233.7591 1262.4375 1289.0980 1315.9510 1337.3330 1352.8347 1384.4299 1434.2716 1443.0754 1449.6143 1457.5595 1478.5561 1585.3945 1608.9731 1628.9573 2967.1603 2991.1409 3026.4721 3028.8889 3056.9436 3104.4514 3125.2874 3134.7230 3146.5283 3160.2028 3170.3983
redmass: 3.9442 3.4766 3.6631 4.5816 3.2320 6.3644 2.1278 5.6582 4.0688 2.8482 4.1210 3.8802 3.5254 5.2868 6.6484 4.5766 5.5315 1.8570 1.7894 1.7896 1.4405 2.4460 2.1747 3.7043 1.4391 1.4289 5.0275 2.6189 1.3286 2.0426 1.6018 2.0778 1.7127 1.2351 1.0643 1.2993 1.1468 3.1446 1.2198 1.2163 1.3225 1.3428 1.3535 8.7512 2.2120 1.1055 1.0854 1.1042 2.2537 6.1085 6.0860 8.3784 1.0652 1.0618 1.0772 1.0786 1.0989 1.1076 1.0848 1.0884 1.0933 1.0969 1.0990
irintensity: 0.0842 2.5031 2.4604 2.2746 1.5802 1.7606 4.3777 12.6917 0.4208 0.0553 1.4586 1.0847 14.0699 8.4954 1.3028 2.0812 23.9278 48.0070 57.2673 5.7023 5.4082 25.2562 32.1992 84.5135 4.5784 2.2091 1.8469 23.4313 1.2131 7.6813 7.7748 8.5209 8.4400 1.2940 1.5415 7.4969 8.3026 54.5750 8.6995 15.9125 2.9973 16.8564 19.2895 0.4897 15.9695 1.5965 15.2644 6.2282 11.6544 9.5631 2.8310 108.3317 41.3250 34.8646 33.9235 29.5935 37.3423 15.9701 0.5231 9.0279 24.0871 20.9250 19.3962
temp: 298.150 k
press: 1.00000 atm
elementType: 16 7 6 6 6 6 6 6 6 6 6 6 1 1 1 1 1 1 1 1 1 1 1
symmnumber: 1
zpe: 484789.8 jmol-1
zpe.correction: 0.184647 hartree
zpe.thermalcorrener: 0.195251 hartree
zpe.thermalcorrenthalpy: 0.196195 hartree
zpe.thermalcorrgfe: 0.147066 hartree
zpe.sumelectzpe: -839.598109 hartree
zpe.sumelectthermal: -839.587504 hartree
zpe.sumelectthermalent: -839.586560 hartree
zpe.sumelectthermalfe: -839.635690 hartree
dipole: -1.7549 0.2430 0.1012
dipole: 1.7745
quadrupole: -59.0000 -76.4657 -82.1328
quadrupole: -1.8027 -1.1328 -1.9047
quadrupole: 13.5329 -3.9329 -9.6000 -1.8027 -1.1328 -1.9047
hfenergy: -839.7827556 hartree
pointgroup: C01 [X(C10H11N1S1)]
dipole: -0.6942633 0.0651569 0.0342538 debye
dipolederiv: -0.3682877 -0.2132518 -0.0661636 -0.3405396 -0.6118703 -0.0505352 -0.1331045 -0.0909079 -0.1133361 -0.6883189 0.0619956 -0.0365594 0.0753681 -0.9820262 -0.1628615 -0.0144746 -0.1343309 -0.3021576 -0.1930622 0.0547632 -0.0508114 -0.0211103 -0.0538034 -0.0232246 0.0051106 -0.0168854 0.07323 0.4061776 0.0158087 -0.0306743 -0.0226637 -0.0038347 -0.0172899 -0.0384008 -0.0015866 0.1372299 0.4304103 -0.1833939 0.0185013 -0.0713445 0.3282566 0.0422679 0.0572071 -0.0145295 0.2554778 1.0499012 0.2385855 0.0511457 0.5138506 1.1992406 0.2340178 0.1470707 0.1965721 0.0381162 -0.2219423 -0.0300472 0.0021887 -0.1752209 -0.12547 -0.0202093 -0.0408729 0.0078991 0.0066236 -0.061677 -0.1008119 0.0061567 0.0681983 0.0224536 -0.0155108 0.0026337 -0.001751 -0.1191506 -0.0241861 0.0770462 -0.0224034 -0.000762 -0.0169851 -0.020566 -0.036509 -0.0171651 -0.1365297 -0.0804698 0.1262943 -0.0157519 0.139634 0.0846934 -0.0237557 -0.0075836 -0.0167036 -0.1533854 -0.0810872 -0.1182912 0.0104226 -0.2006031 0.0807859 -0.0151794 0.0142509 -0.0158961 -0.1538562 0.069087 -0.0016305 -0.0052491 0.0077546 -0.022015 -0.0109847 -0.0079796 -0.014735 -0.1540228 -0.2163563 0.0701119 0.0089591 0.0915365 0.0720503 0.0047601 0.0047333 0.0113473 0.1034892 0.1180397 -0.0148395 0.0654806 -0.0257793 0.0384011 -0.0048334 -0.0125423 0.0156719 -0.1283654 -0.0541534 -0.0117576 0.0441197 0.0732396 0.0725929 -0.0141655 0.088752 0.0475406 -0.1188317 -0.0526527 -0.0839811 -0.0286732 -0.0639102 -0.0225949 -0.0528745 -0.0400499 -0.0603891 0.0688495 -0.0232459 0.0503143 -0.0111653 0.0562662 -0.1215507 0.062342 -0.0932408 0.111045 0.0639816 -0.0812144 0.0683886 0.0488727 -0.0515615 0.1035002 0.003762 0.0792256 -0.0607744 -0.1307343 0.1179187 0.095957 -0.0074961 0.0534052 0.0110033 0.0179324 -0.0203125 0.0007574 0.1480235 0.0917015 -0.0924001 0.0080602 -0.1041654 -0.0042122 0.0207862 0.0323001 0.0087505 0.1465051 0.0037001 -0.0900446 0.0091267 -0.1123471 -0.073087 0.021435 0.0111183 0.0222564 0.1535015 0.0088535 0.0827224 -0.004479 0.1140264 -0.0694565 0.0184606 -0.0047801 0.0204348 0.1558742 -0.1491358 -0.0015384 0.0063926 -0.0032718 0.0939283 0.0062265 0.0074482 0.0033797 0.1594678 unknown
polarizability: 196.8134496|-1.2971202|134.6245354|-2.2140683|1.7633675|64.3726418 unknown
InChI: InChI=1S/C10H11NS/c1-2-5-9(6-3-1)10-11-7-4-8-12-10/h1-3,5-6H,4,7-8H2
charge 0 multiplicity 1
23 atoms
S  -1.498465 -1.647811 -0.264495
N  -1.320948 1.151831 0.250315
C  -3.61087 0.236148 -0.467379
C  -3.303078 -1.167673 0.074388
C  -2.785187 1.326662 0.249824
C  -0.698779 0.032674 0.051042
C  0.795371 -0.008346 0.027212
C  1.510058 1.216877 -0.084777
C  1.52481 -1.223229 0.113768
C  2.918472 1.223245 -0.113729
C  2.936737 -1.214018 0.081813
C  3.639332 0.006858 -0.032913
H  -4.686874 0.456793 -0.325622
H  -3.408037 0.261491 -1.554405
H  -3.472979 -1.231476 1.162377
H  -3.897315 -1.946105 -0.430239
H  -2.990289 2.313248 -0.20648
H  -3.106953 1.406902 1.309451
H  0.934191 2.145354 -0.143458
H  0.99358 -2.174983 0.223954
H  3.456315 2.173872 -0.202363
H  3.486715 -2.158953 0.152258
H  4.734889 0.011935 -0.057641
