program: Gaussian 09
title: 000241004
version: EM64L-G09RevD.01
frameworkgroup: C1[X(C6H11NS)]
method: RPBEPBE
basis: SDD
operation: Freq
keyword: #p
keyword: freq=noraman
keyword: PBEPBE/SDD
title: #p freq=noraman PBEPBE/SDD
converged: NO YES NO NO
title: Mulliken charges:
elementType: S N C C C C C C H H H H H H H H H H H
charge: 0.141211 0.014526 -0.079692 -0.485654 -0.671235 -0.671458 -0.110025 -0.700095 0.238415 0.238417 0.228539 0.239839 0.209462 0.228535 0.209516 0.239913 0.238313 0.238332 0.253141
chargesum: 0.00000
title: Mulliken charges with hydrogens summed into heavy atoms:
elementType: S N C C C C C C
charge: 0.141211 0.014526 -0.079692 -0.008822 0.006605 0.006506 -0.110025 0.029692
polarizability: 1.06247749e+02 3.89905086e+00 8.78411988e+01 5.25836268e-03 -6.42232736e-03 6.42136923e+01
1716.lowfreq: -60.5678 -13.7892 -9.6929 -0.0035 -0.0032 -0.0010 13.8288 120.7993 209.8757
frequency: -60.2549 120.7975 209.8691 229.3771 249.9604 278.4536 283.2415 303.2224 371.5780 378.1328 475.0509 483.3270 526.3971 557.0755 651.2181 826.0344 886.3028 910.2252 941.7559 948.1425 1005.2920 1038.0492 1068.5854 1127.5751 1149.0504 1159.7716 1199.1458 1251.3437 1300.9779 1377.9191 1387.5119 1395.8790 1452.4956 1454.8455 1455.8149 1460.0194 1463.6687 1470.9601 1482.1122 1650.2803 2969.1362 2972.5957 2986.2628 2992.1423 3034.0398 3063.9509 3068.8309 3075.4002 3091.9654 3095.7252 3119.4775
redmass: 3.1268 1.0792 2.0527 1.2872 1.5377 2.1404 1.5185 2.6592 3.3158 2.3201 4.0775 4.2990 4.7231 5.1731 5.6937 3.0062 3.0802 1.7559 1.3298 2.1299 1.3378 1.4523 2.3575 2.2648 2.9972 1.6081 2.4887 1.7562 1.2818 1.1999 1.2492 1.1963 1.0889 1.0497 1.0451 1.0524 1.0482 1.0497 1.0517 8.1621 1.0378 1.0386 1.0582 1.0364 1.1042 1.0963 1.0962 1.0975 1.1008 1.1004 1.0999
irintensity: 0.0440 1.9374 7.8104 0.2450 3.7569 2.3060 2.0961 0.6164 0.6830 0.0106 2.9883 0.0586 34.5038 17.5219 5.1026 2.8316 49.4475 0.0137 1.1535 11.0798 0.0004 2.1589 26.8877 38.3821 72.5649 1.5225 6.9383 6.1914 3.6223 22.1117 27.9903 9.7915 1.9046 0.6644 23.5615 22.7561 4.8888 12.3058 13.1731 75.4242 17.6737 31.5818 43.2603 14.2725 19.1335 4.1636 38.2595 12.9505 14.8033 31.4797 10.7491
temp: 298.150 k
press: 1.00000 atm
elementType: 16 7 6 6 6 6 6 6 1 1 1 1 1 1 1 1 1 1 1
symmnumber: 1
zpe: 415409.1 jmol-1
zpe.correction: 0.158221 hartree
zpe.thermalcorrener: 0.166814 hartree
zpe.thermalcorrenthalpy: 0.167758 hartree
zpe.thermalcorrgfe: 0.125561 hartree
zpe.sumelectzpe: -687.407552 hartree
zpe.sumelectthermal: -687.398959 hartree
zpe.sumelectthermalent: -687.398014 hartree
zpe.sumelectthermalfe: -687.440211 hartree
dipole: 1.2114 -0.0691 0.0013
dipole: 1.2134
quadrupole: -50.2635 -61.5151 -56.8740
quadrupole: 3.9213 -0.0021 0.0012
quadrupole: 5.9541 -5.2976 -0.6565 3.9213 -0.0021 0.0012
hfenergy: -687.5657727 hartree
pointgroup: C01 [X(C6H11N1S1)]
dipole: -0.4746492 0.0000067 0.0508905 debye
dipolederiv: -0.6974783 -0.2428804 0.0981221 -0.0994803 -0.4494852 0.0589968 0.0762198 0.0742968 -0.1540344 -0.4911161 -0.0645203 0.0337488 -0.2006021 -0.9265851 0.1216754 0.0546923 0.1071955 -0.2939336 0.4477713 -0.109361 -0.006771 -0.3237153 -0.0303763 0.0752094 0.0259866 0.0518982 0.2215857 0.0898407 0.0094638 0.0108032 0.0076601 0.2652513 -0.0102235 0.0108244 -0.0104242 0.2034956 -0.0411747 -0.0173682 0.0423596 0.0434758 0.0701799 -0.0389986 -0.0007143 0.0017121 -0.0862461 -0.051907 -0.035223 -0.0418255 0.043057 0.0670101 -0.0168421 -0.020038 -0.0424709 -0.0719479 0.8817843 0.2574266 -0.142811 0.5329544 0.9905075 -0.2201506 -0.1851544 -0.1903512 -0.0242712 -0.2712852 0.063452 0.0284028 -0.0061687 -0.0292274 0.0171498 0.0392783 0.0094937 0.0734532 0.0020645 0.0747957 -0.0459374 0.0217837 0.0426537 0.0665626 -0.0781248 0.1069737 -0.07013 0.0225145 0.0559906 0.011951 0.0247697 -0.0207917 -0.0912014 0.0571037 -0.1405436 -0.0269761 0.0458861 -0.0673858 0.0417762 -0.1217151 -0.0735368 0.062393 0.0334012 -0.0003646 0.0751521 0.0034844 -0.0342727 -0.1237616 -0.0353177 0.0736398 -0.0463562 -0.0760781 -0.0379235 -0.0454372 -0.066077 0.1107162 0.0355701 0.1593618 -0.0297219 -0.0116718 0.0217755 0.0281235 0.0595403 0.0373875 -0.069194 -0.0115987 -0.130403 -0.0712905 0.0131278 0.0146224 0.063337 0.0810186 -0.0801873 0.0942568 -0.0365926 0.1520746 -0.0348269 0.0094012 -0.0393225 -0.0189823 0.0785616 0.0433945 0.0054959 0.106857 -0.0080147 0.0871116 0.0027519 0.0614008 -0.007095 -0.0987599 0.0761492 -0.0011423 -0.0123101 0.0301132 0.0114577 -0.1139201 0.0394824 -0.108395 0.0040411 0.0648607 0.0210097 -0.0115236 0.0359992 0.0729729 0.0864031 -0.0703596 0.0858811 -0.046109 -0.015912 -0.0512598 0.0235407 -0.1258326 -0.0149428 0.0356931 0.0350044 0.0276388 0.1209971 unknown
polarizability: 105.4272827|-5.224829|87.8007587|-3.6585626|-3.0420033|65.0745985 unknown
InChI: InChI=1S/C6H11NS/c1-5-7-4-6(2,3)8-5/h4H2,1-3H3
charge 0 multiplicity 1
19 atoms
S  0.225619 -1.421328 0.261226
N  1.06466 1.122546 -0.21849
C  -1.167614 -0.07945 0.207316
C  -0.397904 1.27691 -0.083821
C  -1.877799 -0.043044 1.576744
C  -2.147824 -0.426098 -0.933132
C  1.492797 -0.093344 -0.078499
C  2.933807 -0.513831 -0.170844
H  -0.78218 1.730068 -1.017978
H  -0.592756 1.999801 0.731754
H  -2.366023 -1.00707 1.80542
H  -1.165012 0.182581 2.388479
H  -2.660495 0.741504 1.570365
H  -2.644268 -1.397421 -0.759624
H  -2.935219 0.351116 -0.998739
H  -1.625744 -0.475433 -1.904114
H  3.074024 -1.254818 -0.978867
H  3.264759 -0.987479 0.771365
H  3.562274 0.367393 -0.373959
