program: Gaussian 09
title: 000241065
version: EM64L-G09RevD.01
frameworkgroup: C1[X(C24H25ClO3)]
method: RPBEPBE
basis: SDD
operation: Freq
keyword: #p
keyword: freq=noraman
keyword: PBEPBE/SDD
title: #p freq=noraman PBEPBE/SDD
converged: YES YES NO NO
title: Mulliken charges:
elementType: Cl O O O C C C C C C C C C C C C C C C C C C C C C C C C H H H H H H H H H H H H H H H H H H H H H H H H H
charge: -0.093655 -0.432790 -0.448154 -0.448115 -0.701388 -0.771552 0.384476 0.413133 0.379143 0.448233 -0.118869 -0.353377 -0.356425 -0.051678 -0.056506 -0.519245 -0.520936 0.365702 0.369724 -0.125358 0.490445 0.484656 -0.636455 -0.638159 -0.875592 -0.872809 -0.826034 -0.825334 0.236851 0.239213 0.274067 0.192377 0.289641 0.285491 0.258099 0.218461 0.233254 0.236668 0.248629 0.229594 0.234551 0.250728 0.231263 0.236987 0.223253 0.221049 0.227351 0.231421 0.226590 0.223693 0.347071 0.368414 0.372201
chargesum: 0.00000
title: Mulliken charges with hydrogens summed into heavy atoms:
elementType: Cl O O O C C C C C C C C C C C C C C C C C C C C C C C C
charge: -0.093655 -0.085718 -0.079740 -0.075913 -0.225324 -0.305108 0.384476 0.413133 0.379143 0.448233 -0.118869 -0.063736 -0.070935 -0.051678 -0.056506 -0.261146 -0.302475 0.365702 0.369724 -0.125358 0.490445 0.484656 -0.403201 -0.401491 -0.162818 -0.153831 -0.154381 -0.143630
polarizability: 2.86883401e+02 -3.33667416e+00 3.15077691e+02 -3.78323550e-01 -1.89228946e+01 2.28619134e+02
1716.lowfreq: -9.6948 -6.0867 -2.7986 -0.0009 0.0008 0.0012 4.5569 10.8794 14.2492
frequency: -8.9764 10.8399 14.1226 33.2580 34.5057 42.8917 46.0408 51.4997 102.4796 114.9564 115.2521 138.4553 146.6483 153.2935 158.8704 159.4034 175.8653 188.0264 205.3957 216.3837 226.2684 255.7252 270.6561 273.9047 283.8906 288.5773 308.2788 315.3075 341.5754 348.7191 352.0670 356.3048 359.5347 366.9809 388.5215 449.0960 454.3560 464.5157 480.2786 490.7387 496.7000 509.8461 529.3430 541.5092 556.2302 559.7717 561.9074 563.4307 579.2644 583.9939 628.2853 672.5487 700.5355 730.4882 736.4194 737.2296 758.6592 788.5182 850.8935 863.0160 870.2267 888.0223 893.6523 900.4628 906.3217 916.2305 917.6746 928.6883 935.7948 955.8913 972.5373 979.7479 1010.0724 1011.8545 1014.9501 1016.5458 1041.7239 1041.9757 1048.2828 1049.4137 1085.9067 1136.7471 1137.3193 1146.4747 1156.0932 1162.9552 1178.7128 1182.6223 1211.3990 1229.4709 1231.4423 1253.5352 1276.8710 1280.7976 1288.2583 1304.2062 1305.9373 1327.5767 1327.8716 1383.0464 1383.7216 1387.1960 1396.6385 1397.4858 1398.7600 1399.1634 1419.3464 1422.1355 1422.6643 1446.4420 1455.6546 1457.6563 1469.9126 1470.4354 1471.4316 1479.2112 1479.5254 1480.4212 1482.8107 1487.9608 1496.8660 1498.4124 1583.6655 1609.0354 1612.6992 1614.9605 1625.5013 1626.5834 2949.1990 2951.9537 2959.8650 2968.7259 2971.7961 3016.0947 3019.6156 3026.1357 3044.7865 3048.3460 3068.0174 3077.0546 3080.4931 3085.0596 3087.1653 3087.4265 3108.2524 3116.2023 3120.7089 3132.0998 3168.5122 3171.8191 3570.4705 3584.3486 3587.3074
redmass: 4.1351 5.2707 4.2423 5.8870 3.6908 1.3133 2.7954 1.1158 5.7064 4.7661 4.9509 5.5241 3.9082 2.2682 1.2543 1.7092 3.0778 3.1157 2.5300 2.8312 4.0814 3.2137 2.6242 2.1851 1.3475 1.3114 3.1612 3.6720 1.2555 5.1568 3.8995 4.3904 3.7696 5.4326 2.9013 5.6174 5.5979 4.5478 3.9809 2.7479 3.4867 3.8337 3.9607 3.8811 3.5387 3.7487 4.0321 4.0903 4.1304 4.3469 4.8687 4.3334 5.2044 4.7676 4.5820 4.6719 4.4294 4.7702 3.5679 1.6394 1.3406 1.3566 1.6409 1.5486 2.0704 1.7882 2.0828 2.1355 2.0894 2.8898 3.4587 2.8697 1.5565 1.4910 1.6471 1.7885 1.5041 1.5061 1.5466 1.5437 2.0754 2.7098 2.2159 1.7895 1.4101 1.5878 1.3694 1.3394 2.0857 1.8299 1.8276 1.8111 1.3755 1.6023 1.5437 1.3904 1.3984 5.5072 5.4666 3.5668 3.3598 5.3171 1.2520 1.3723 1.3110 1.3890 3.5421 3.2352 2.8505 2.6550 1.8330 1.9352 1.0470 1.1466 1.0467 1.0447 1.0459 1.1822 1.1795 1.1626 1.5268 1.4728 6.8796 6.9516 6.4596 6.8745 6.4834 6.4677 1.0401 1.0401 1.0699 1.0375 1.0375 1.0979 1.0980 1.0589 1.0973 1.0976 1.0904 1.0984 1.0984 1.0942 1.1035 1.0943 1.0910 1.0913 1.0916 1.0920 1.0928 1.0932 1.0650 1.0654 1.0655
irintensity: 0.0558 0.2360 0.0864 0.0822 0.1723 1.0251 1.2527 0.3092 0.3878 0.3124 0.0506 0.1996 1.1238 0.1365 0.0899 0.0377 3.7252 1.2196 6.8318 6.8641 9.6005 18.9333 0.7767 46.8708 68.7597 89.0112 0.4606 1.3636 121.6305 5.1688 19.6302 5.7018 4.8075 4.2778 3.3475 0.2660 3.4672 0.3548 8.6681 2.6559 0.1387 0.5015 5.8758 11.5008 7.6474 7.9377 14.9325 3.1481 1.8466 13.2114 2.5382 1.7867 30.6143 1.1982 7.3546 14.5008 4.5380 14.3554 25.0510 32.2450 20.8083 5.9490 12.9377 19.3324 7.8413 11.6109 1.7123 10.5612 19.4181 9.3887 19.4442 5.6452 3.6774 4.9873 6.1995 7.8010 1.6004 0.8922 21.1944 11.8463 14.0639 75.8060 8.8145 181.1190 80.3274 59.5686 62.3815 37.5903 12.9455 4.8670 2.2386 7.7505 10.2569 37.4927 12.6458 5.1937 6.8195 0.1934 0.8468 1.7182 1.3850 7.8882 2.2238 15.3723 8.9048 35.8451 6.4436 6.5497 6.7688 132.4760 31.5772 15.7660 9.6610 9.8620 7.8562 13.5684 15.1156 13.0651 9.9834 49.1362 12.0962 45.6882 19.0469 15.3888 0.2064 0.9018 0.7980 1.4582 42.5026 38.7939 44.7806 54.2393 29.0640 23.2719 21.3987 20.0785 26.8538 26.1744 2.7789 20.8922 18.4901 13.1515 2.4449 12.6090 24.2951 22.7658 15.5715 4.4834 0.5060 0.3960 22.3585 28.2753 33.2518
temp: 298.150 k
press: 1.00000 atm
elementType: 17 8 8 8 6 6 6 6 6 6 6 6 6 6 6 6 6 6 6 6 6 6 6 6 6 6 6 6 1 1 1 1 1 1 1 1 1 1 1 1 1 1 1 1 1 1 1 1 1 1 1 1 1
symmnumber: 1
zpe: 1109638.9 jmol-1
zpe.correction: 0.422639 hartree
zpe.thermalcorrener: 0.450713 hartree
zpe.thermalcorrenthalpy: 0.451657 hartree
zpe.thermalcorrgfe: 0.361936 hartree
zpe.sumelectzpe: -1613.281659 hartree
zpe.sumelectthermal: -1613.253586 hartree
zpe.sumelectthermalent: -1613.252642 hartree
zpe.sumelectthermalfe: -1613.342363 hartree
dipole: -1.9580 -3.3638 -1.7744
dipole: 4.2776
quadrupole: -142.4181 -175.4274 -162.0479
quadrupole: 1.5266 -3.5172 -0.3983
quadrupole: 17.5464 -15.4630 -2.0835 1.5266 -3.5172 -0.3983
hfenergy: -1613.7042985 hartree
pointgroup: C01 [X(C24H25Cl1O3)]
dipole: -0.789851 -1.3842741 -0.5405338 debye
polarizability: 286.7821913|-2.799001|309.4758957|-0.1110122|-28.6315989|234.3221388 unknown
InChI: InChI=1S/C24H25ClO3/c1-13-5-15(3)22(26)17(7-13)9-19-11-21(25)12-20(24(19)28)10-18-8-14(2)6-16(4)23(18)27/h5-8,11-12,26-28H,9-10H2,1-4H3
charge 0 multiplicity 1
53 atoms
Cl -0.044846 4.358558 -1.807845
O  0.110702 0.1782 2.536785
O  4.301141 1.523385 -0.683084
O  -4.401712 1.54455 -0.532674
C  2.584114 1.113327 1.53373
C  -2.565382 1.070435 1.548912
C  1.252259 1.647183 1.010494
C  -1.233922 1.626161 1.035811
C  3.107761 -0.054765 0.698951
C  -3.095931 -0.07467 0.685343
C  0.019223 1.159794 1.5203
C  1.219781 2.62551 -0.010977
C  -1.239585 2.609514 0.015596
C  3.957594 0.174864 -0.412941
C  -4.008345 0.194684 -0.366562
C  2.744292 -1.387528 0.99406
C  -2.679046 -1.410819 0.875018
C  4.445092 -0.889531 -1.215925
C  -4.504184 -0.833597 -1.210282
C  -0.019486 3.087242 -0.486936
C  3.200258 -2.480808 0.215727
C  -3.140482 -2.468972 0.053197
C  4.051142 -2.208033 -0.881893
C  -4.054099 -2.155804 -0.981233
C  5.357298 -0.610373 -2.398691
C  -5.484472 -0.510401 -2.324882
C  2.779718 -3.902553 0.550808
C  -2.656239 -3.892371 0.272819
H  2.451361 0.777765 2.575992
H  3.325696 1.930022 1.519958
H  -3.306059 1.887224 1.55472
H  -2.486246 0.724206 2.601042
H  2.162763 2.99761 -0.420755
H  -2.195872 2.969363 -0.374299
H  2.077543 -1.561897 1.847146
H  -1.964926 -1.63901 1.677357
H  4.419914 -3.038589 -1.4975
H  -4.426647 -2.958189 -1.630424
H  5.640269 -1.550348 -2.900483
H  6.301798 -0.113154 -2.095148
H  4.8692 0.027661 -3.163857
H  -5.768033 -1.425273 -2.870421
H  -6.424211 -0.062154 -1.941676
H  -5.054683 0.188112 -3.071721
H  1.684151 -4.032177 0.454399
H  3.26241 -4.635821 -0.118669
H  3.046682 -4.169769 1.590702
H  -1.563903 -3.974304 0.112704
H  -2.860278 -4.237121 1.304073
H  -3.148007 -4.597476 -0.41929
H  -0.786806 -0.016592 2.904037
H  4.911178 1.576661 -1.459444
H  -5.044535 1.631968 -1.278775
