program: Gaussian 09
title: 000241026
version: EM64L-G09RevD.01
frameworkgroup: C1[X(C13H18ClNO)]
method: RPBEPBE
basis: SDD
operation: Freq
keyword: #p
keyword: freq=noraman
keyword: PBEPBE/SDD
title: #p freq=noraman PBEPBE/SDD
converged: YES YES NO NO
title: Mulliken charges:
elementType: Cl O N C C C C C C C C C C C C C H H H H H H H H H H H H H H H H H H
charge: -0.055007 -0.285332 -0.170492 0.011050 -0.080983 -0.708581 -0.705203 -0.670053 -0.680432 0.144219 0.275087 -0.332096 -0.370551 -0.224824 -0.209364 -0.100587 0.187554 0.246141 0.209155 0.269838 0.211284 0.219068 0.206220 0.272988 0.220686 0.213363 0.218070 0.229274 0.218610 0.214175 0.244303 0.266861 0.257500 0.258060
chargesum: 0.00000
title: Mulliken charges with hydrogens summed into heavy atoms:
elementType: Cl O N C C C C C C C C C C C C C
charge: -0.055007 -0.285332 -0.170492 0.198604 0.165158 -0.018303 -0.006927 -0.017934 -0.018373 0.144219 0.275087 -0.087792 -0.103690 0.032676 0.048696 -0.100587
polarizability: 2.25606770e+02 -5.52380325e+00 1.40458020e+02 -3.07895864e+00 -1.46432924e+01 1.19910911e+02
1716.lowfreq: -19.0315 -10.9488 -6.0727 -0.0023 -0.0022 -0.0018 31.8847 37.8506 59.1593
frequency: 31.3797 37.7204 59.1559 86.5469 95.9310 138.6163 153.2933 178.5849 184.6851 192.6278 210.2493 227.2460 239.7965 248.6676 268.5534 295.3383 318.5959 333.5536 358.7439 406.7955 417.2765 438.4992 484.9859 501.4835 516.4376 557.8985 605.7784 620.3877 688.7598 713.8779 739.2313 817.8829 830.1096 840.7941 867.6539 905.8561 913.2430 920.0868 937.1982 943.0499 955.4038 968.3325 999.7760 1023.6328 1070.3030 1087.4086 1106.9216 1127.9941 1146.2293 1149.9512 1163.8786 1182.2380 1183.4585 1206.6920 1292.1388 1311.2479 1313.9578 1319.9515 1359.1828 1364.6608 1367.8728 1379.4452 1382.5619 1389.0367 1396.9764 1415.8307 1454.3381 1461.6707 1467.4804 1468.6925 1474.0571 1477.0744 1484.2335 1486.5474 1501.2958 1544.9009 1579.9646 1593.4260 2982.1288 2985.7804 2986.6915 2989.6503 3011.3085 3047.1198 3075.2423 3077.2145 3081.9597 3083.8059 3087.4424 3092.3091 3109.4016 3116.6635 3141.1365 3154.3140 3170.6168 3176.2273
redmass: 4.6239 3.7920 5.3737 2.9742 2.6710 4.9118 2.2882 3.1098 3.1576 1.3970 1.2277 1.4306 1.3226 1.4613 6.1250 4.7545 3.4638 2.9817 2.6740 2.9021 3.4265 4.5351 3.1725 3.2193 4.5915 3.1828 3.3224 7.0165 5.4275 6.3207 3.6320 2.5936 1.3311 1.7215 2.5841 2.2601 1.3385 1.1869 1.3539 1.4783 1.3529 1.3769 4.2226 1.9592 3.2546 1.9812 1.3830 2.3619 2.3569 2.1964 2.2043 2.6533 1.1390 2.6383 1.2509 1.3476 2.2947 1.3861 2.7312 1.5906 1.2100 1.2148 1.2339 3.6715 1.2509 1.7420 1.0443 1.0488 1.0776 1.0742 2.1903 1.0880 1.0517 1.0597 1.0812 5.8709 7.5685 6.2840 1.0354 1.0359 1.0360 1.0378 1.0822 1.0861 1.0996 1.0993 1.0988 1.0999 1.0980 1.0993 1.1001 1.0996 1.0889 1.0889 1.0959 1.0974
irintensity: 0.4199 0.0076 1.6046 0.1304 1.3712 1.0861 0.2593 0.9915 2.0436 0.4345 0.3393 0.5391 0.3838 1.2804 4.0446 0.3791 1.6811 0.2450 4.3583 0.3907 4.6639 17.8298 13.6580 9.8504 11.7002 17.5169 1.0277 1.6744 9.3548 9.4496 18.5165 44.6350 2.2109 41.3669 5.0248 13.2813 3.1760 3.9974 0.0459 0.1040 0.2255 1.1994 55.3876 22.0458 45.6005 16.4357 9.4917 1.3256 20.8222 20.9954 46.1810 22.4191 1.2079 23.3601 0.4338 4.1008 259.9654 37.4098 6.8331 5.9052 23.6358 33.5395 57.9340 7.5856 3.4813 89.7245 0.6643 2.9296 23.8817 17.1248 16.3508 19.5615 2.9256 6.8178 20.4025 169.3482 17.6986 50.0244 18.9148 16.8906 38.2136 34.4329 30.8141 0.5450 7.2775 8.1558 83.8976 27.2107 48.0122 46.4454 6.1368 16.8443 6.7604 0.8663 5.2160 1.5871
temp: 298.150 k
press: 1.00000 atm
elementType: 17 8 7 6 6 6 6 6 6 6 6 6 6 6 6 6 1 1 1 1 1 1 1 1 1 1 1 1 1 1 1 1 1 1
symmnumber: 1
zpe: 737822.9 jmol-1
zpe.correction: 0.281022 hartree
zpe.thermalcorrener: 0.298441 hartree
zpe.thermalcorrenthalpy: 0.299385 hartree
zpe.thermalcorrgfe: 0.235457 hartree
zpe.sumelectzpe: -1095.010684 hartree
zpe.sumelectthermal: -1094.993266 hartree
zpe.sumelectthermalent: -1094.992321 hartree
zpe.sumelectthermalfe: -1095.056249 hartree
dipole: 2.4174 3.7033 0.6964
dipole: 4.4770
quadrupole: -106.3637 -107.1864 -100.9314
quadrupole: 6.1796 -0.4335 -5.0228
quadrupole: -1.5365 -2.3592 3.8958 6.1796 -0.4335 -5.0228
hfenergy: -1095.2917061 hartree
pointgroup: C01 [X(C13H18Cl1N1O1)]
dipole: -0.9497489 1.470453 0.1953849 debye
polarizability: 225.6526097|5.366585|129.1313278|1.295645|18.0013418|131.1917636 unknown
InChI: InChI=1S/C13H18ClNO/c1-9(2)15(10(3)4)13(16)11-5-7-12(14)8-6-11/h5-10H,1-4H3
charge 0 multiplicity 1
34 atoms
Cl 5.388576 0.247839 0.21279
O  -0.943073 -2.023739 -0.535998
N  -1.625783 0.151165 -0.007265
C  -3.071212 -0.266275 0.037449
C  -1.334365 1.620562 0.029893
C  -3.335104 -1.261013 1.191491
C  -3.57855 -0.802511 -1.323586
C  -1.733073 2.256207 1.383108
C  -1.987049 2.363608 -1.161997
C  -0.652426 -0.814095 -0.244423
C  0.812419 -0.439935 -0.132907
C  1.362437 0.182946 1.016825
C  1.686657 -0.87869 -1.159606
C  2.755302 0.387199 1.13448
C  3.078009 -0.662453 -1.069459
C  3.590298 -0.028229 0.079742
H  -3.629257 0.661671 0.264512
H  -0.242639 1.720483 -0.085989
H  -4.418025 -1.473527 1.25731
H  -2.802071 -2.208818 1.016712
H  -3.005987 -0.83956 2.158535
H  -3.404844 -0.069187 -2.130922
H  -4.665499 -0.997123 -1.262607
H  -3.061437 -1.739882 -1.580113
H  -1.42083 3.315993 1.407418
H  -2.826249 2.227611 1.544612
H  -1.251048 1.733343 2.228179
H  -1.656538 1.933037 -2.123453
H  -1.692359 3.428621 -1.139896
H  -3.090394 2.321376 -1.121968
H  0.709856 0.48706 1.842405
H  1.26919 -1.408374 -2.021647
H  3.179672 0.853569 2.028066
H  3.749595 -0.989877 -1.867989
