program: Gaussian 09
title: 000020484
version: EM64L-G09RevD.01
frameworkgroup: C1[X(C6H13NO5)]
method: RPBEPBE
basis: SDD
operation: Freq
keyword: #p
keyword: freq=noraman
keyword: PBEPBE/SDD
title: #p freq=noraman PBEPBE/SDD
converged: NO YES NO NO
title: Mulliken charges:
elementType: O O O O O N C C C C C C H H H H H H H H H H H H H
charge: -0.273150 -0.460259 -0.449833 -0.479148 -0.451824 -0.642536 -0.193172 0.305794 -0.167276 -0.075759 -0.340270 -0.488314 0.251725 0.271295 0.212390 0.236338 0.212893 0.243366 0.214001 0.345601 0.384747 0.366161 0.361525 0.302063 0.313643
chargesum: 0.00000
title: Mulliken charges with hydrogens summed into heavy atoms:
elementType: O O O O O N C C C C C C
charge: -0.273150 -0.114658 -0.065086 -0.112987 -0.090299 -0.026830 0.058553 0.305794 0.104019 0.136631 0.108961 -0.030948
polarizability: 9.84464512e+01 -2.29874214e+00 8.80356237e+01 1.28154837e+00 -3.41586798e+00 7.43696909e+01
1716.lowfreq: -0.0009 0.0006 0.0006 4.1775 7.4689 14.3084 73.6571 97.0615 114.4727
frequency: 73.6200 97.0565 114.4672 168.7506 190.5253 229.7724 247.0947 268.9876 287.7660 319.2277 329.4153 358.1906 390.1348 395.9553 400.1287 481.5514 500.1220 522.5412 541.0880 589.1649 661.9403 740.5352 750.6065 777.1978 826.1662 833.0637 869.5207 901.8315 920.7049 963.1313 985.7839 1010.0776 1036.3743 1050.9843 1060.0544 1089.6792 1125.0667 1145.5115 1166.8176 1174.1533 1211.9348 1233.1956 1261.0200 1264.0894 1304.8977 1324.8095 1339.5118 1351.7523 1357.1422 1372.1409 1383.9414 1393.8812 1424.0080 1443.5076 1457.8787 1629.8915 2954.3599 2989.8549 3000.3920 3005.4351 3033.1057 3064.1646 3102.6303 3104.5240 3472.6158 3490.1467 3534.5939 3590.6760 3599.0061
redmass: 3.4290 3.3903 5.9584 3.2138 4.9591 5.7259 4.2112 1.4988 2.8262 2.2458 2.5825 1.6171 4.7479 3.4379 3.1334 1.9065 1.3056 1.5938 4.2078 4.3801 3.2709 1.8948 2.6054 3.7262 3.5414 3.4937 1.1918 2.2307 2.9156 1.8216 3.1653 4.1994 4.0790 3.0832 2.6765 1.9865 2.3059 2.7070 1.2075 1.8706 1.1871 1.2107 1.1228 1.2657 1.3444 1.3282 1.2488 1.2993 1.2770 1.3774 1.5422 1.6781 1.6501 1.0876 1.0942 1.0904 1.0831 1.0614 1.0822 1.0653 1.0852 1.1029 1.0744 1.0875 1.0460 1.0644 1.0650 1.0668 1.0979
irintensity: 5.2798 0.7019 13.4509 13.7660 11.4294 38.6817 3.3807 83.5292 4.9687 21.6512 3.7174 9.9780 7.4807 32.7632 8.2357 56.6731 69.4781 185.4126 10.2862 27.5484 55.3367 101.4396 17.5601 35.5228 5.9421 105.1332 107.4430 34.3454 53.9933 111.2155 29.5021 97.4153 44.7290 53.2132 5.7128 32.6825 63.3887 46.7604 46.6280 25.3779 29.6354 28.3009 8.3761 30.1748 6.5368 22.8952 5.6633 5.4133 7.8132 26.2903 20.1394 13.4337 120.3463 8.7936 21.9684 56.6380 47.1654 26.6307 14.8068 61.3290 31.0582 23.0677 173.9800 82.7320 2.9380 22.0375 22.6623 7.7171 10.3110
temp: 298.150 k
press: 1.00000 atm
elementType: 8 8 8 8 8 7 6 6 6 6 6 6 1 1 1 1 1 1 1 1 1 1 1 1 1
symmnumber: 1
zpe: 534072.0 jmol-1
zpe.correction: 0.203417 hartree
zpe.thermalcorrener: 0.215856 hartree
zpe.thermalcorrenthalpy: 0.216800 hartree
zpe.thermalcorrgfe: 0.165994 hartree
zpe.sumelectzpe: -666.289970 hartree
zpe.sumelectthermal: -666.277531 hartree
zpe.sumelectthermalent: -666.276587 hartree
zpe.sumelectthermalfe: -666.327393 hartree
dipole: -4.1092 1.6044 -1.4786
dipole: 4.6525
quadrupole: -61.8363 -69.0056 -73.5324
quadrupole: 1.0343 5.4652 -10.3257
quadrupole: 6.2885 -0.8809 -5.4076 1.0343 5.4652 -10.3257
hfenergy: -666.4933868 hartree
pointgroup: C01 [X(C6H13N1O5)]
dipole: 1.6519839 -0.5910989 -0.5215796 debye
dipolederiv: -0.8018216 0.1480509 0.0278042 0.3242302 -0.8376041 -0.0406586 0.0384609 -0.1075452 -0.4684865 -0.5124171 0.0224238 -0.1695632 0.01706 -0.9147265 -0.1189237 -0.16538 -0.0565 -0.2394136 -0.7426279 0.0446229 -0.0056592 0.1229442 -0.5543812 0.0251784 -0.2618836 0.1588743 -0.7877048 -0.7678624 -0.2958836 -0.0018186 -0.3109337 -0.5242812 -0.0398567 0.0025523 -0.0353668 -0.5336766 -0.561384 0.2069952 -0.1509517 0.2326803 -0.4552829 0.0195132 -0.1719536 -0.00726 -0.6855138 -0.686556 -0.1218604 -0.0123047 -0.1515781 -0.2618778 0.0007855 0.0341321 0.0440819 -0.6539729 0.0562445 -0.1198683 0.0219038 0.0134709 0.6290947 0.0733836 0.104928 0.1038179 0.1841807 0.6117742 -0.175145 0.1054251 -0.2749223 0.7574539 -0.0605977 0.4045061 -0.1422293 0.6148559 0.4428947 0.2409733 0.0521824 0.2332618 0.2594019 0.0749389 -0.0266134 -0.0014441 0.2709061 0.3176493 -0.0760125 0.1152014 -0.2049892 0.2175822 0.0123146 0.1282316 -0.0037033 0.5656441 0.5398392 -0.1825506 -0.1081744 -0.1182339 0.290618 0.0239614 -0.1499388 0.2063669 0.3380328 0.3120975 0.0940273 0.1993726 0.1027407 0.1570145 0.0253418 0.0299319 -0.0576507 0.1957263 0.0637701 -0.0044224 -0.0174382 -0.0125216 -0.01947 0.030994 -0.022326 0.0339835 -0.1033563 0.0336416 -0.0096514 -0.0359695 0.0060472 0.0291598 0.0498587 -0.0384198 0.0098472 -0.0871787 -0.1101425 0.0834909 0.1172706 0.0458013 0.0222768 -0.0319278 0.0721061 -0.0323095 -0.1431648 0.0375097 0.0406946 0.0140588 0.0434056 -0.1069023 0.012101 0.020107 0.0600334 0.0902599 -0.0071525 0.0190195 -0.0212362 -0.0073496 0.097446 0.0260639 0.0308871 -0.0872086 -0.1491072 0.0300424 -0.0204926 -0.0655477 -0.0229848 0.0551435 0.0841083 -0.0526738 0.0378472 -0.1490791 0.0495678 0.0335026 -0.009863 0.040912 -0.1370965 -0.062076 -0.036037 -0.0235127 0.0681758 0.234354 0.0741539 0.1698635 0.0349496 0.3012579 0.0241818 0.166864 -0.0152781 0.1428841 0.5247146 -0.0006167 -0.1390596 -0.0127067 0.2824569 -0.0235091 -0.098456 -0.0163245 0.3528153 0.3672655 0.1265979 -0.0360138 0.0906144 0.1657372 -0.0171458 -0.0637804 -0.0169994 0.3299999 0.2945498 -0.1537214 0.0087 -0.1818407 0.281554 -0.0344291 0.022374 -0.0264277 0.2870173 0.0507921 0.0315688 -0.0028706 0.0085541 0.1801211 -0.0590381 0.0767066 -0.0739649 0.2844724 0.2232568 -0.0058967 -0.0553121 -0.0186119 0.0853039 0.0054376 -0.0443252 0.0488723 0.2756836 unknown
polarizability: 98.475866|-2.6421355|87.2859781|0.2705283|4.5316973|75.0899217 unknown
InChI: InChI=1S/C6H13NO5/c7-2-6(11)5(10)4(9)3(8)1-12-6/h3-5,8-11H,1-2,7H2
charge 0 multiplicity 1
25 atoms
O  0.638195 1.409948 -0.204262
O  -0.146033 -2.289064 -0.370409
O  1.14416 -0.273853 1.456296
O  -2.682821 -1.170014 -0.124909
O  -2.307304 1.349801 -1.072105
N  3.358393 0.284527 0.184396
C  -0.26746 -0.82313 -0.464566
C  0.947534 -0.025681 0.059802
C  -1.498026 -0.462386 0.382649
C  -1.806811 1.04464 0.271582
C  -0.546052 1.878445 0.543493
C  2.285665 -0.25475 -0.685983
H  -0.442181 -0.507293 -1.514177
H  -1.292368 -0.737733 1.434367
H  -2.576924 1.305815 1.029918
H  -0.705016 2.913873 0.204264
H  -0.32577 1.861128 1.628405
H  2.229535 0.217719 -1.685358
H  2.454572 -1.340244 -0.803385
H  0.387896 -2.631903 -1.128391
H  2.138376 -0.080791 1.571531
H  -2.407652 -2.114565 -0.26072
H  -2.944687 0.61684 -1.292464
H  4.266248 -0.177583 0.092053
H  3.43173 1.306254 0.137173
