program: Gaussian 09
title: 000240997
version: EM64L-G09RevD.01
frameworkgroup: C1[X(C12H18N2O2)]
method: RPBEPBE
basis: SDD
operation: Freq
keyword: #p
keyword: freq=noraman
keyword: PBEPBE/SDD
title: #p freq=noraman PBEPBE/SDD
converged: YES YES NO NO
title: Mulliken charges:
elementType: O O N N C C C C C C C C C C C C H H H H H H H H H H H H H H H H H H
charge: -0.258942 -0.245535 -0.122198 -0.102688 -0.150065 -0.105763 -0.441090 -0.446972 -0.463670 -0.450433 0.138405 0.089292 -0.388435 -0.416376 -0.390800 -0.412119 0.217335 0.223452 0.215680 0.207967 0.209205 0.196748 0.232243 0.236321 0.253288 0.211678 0.244865 0.252218 0.239981 0.244439 0.247781 0.235817 0.239849 0.258520
chargesum: 0.00000
title: Mulliken charges with hydrogens summed into heavy atoms:
elementType: O O N N C C C C C C C C C C C C
charge: -0.258942 -0.245535 -0.122198 -0.102688 0.067270 0.117690 -0.017443 -0.041019 0.004895 0.014533 0.138405 0.089292 0.108648 0.068045 0.092797 0.086250
polarizability: 1.79943637e+02 3.30112835e-01 1.41489337e+02 -3.41863375e+00 1.52796911e+00 1.09893014e+02
1716.lowfreq: -14.6666 -10.8176 -0.0003 0.0002 0.0005 8.8082 17.2787 34.7363 44.2015
frequency: -11.2737 34.6905 44.1518 90.6153 106.3659 131.3317 149.1179 150.4245 174.2611 199.3835 207.6756 230.2846 276.1394 281.2556 308.4933 347.7748 388.4110 439.4252 461.6440 530.9540 579.1744 610.1662 660.9636 705.0259 716.6414 776.7724 785.4860 788.9862 798.7817 819.6062 848.8224 906.7840 918.6215 921.1714 936.0531 942.3250 944.5923 988.2785 999.5405 1004.3416 1047.2259 1072.5068 1089.7822 1096.3568 1100.1470 1100.9717 1102.2702 1106.2563 1110.5707 1116.5881 1121.8757 1133.2472 1137.5475 1145.3169 1166.1976 1186.7042 1217.4674 1259.5772 1284.5402 1287.7912 1308.4343 1328.3213 1340.5403 1344.7101 1352.4326 1367.5183 1399.3603 1409.1297 1456.3964 1458.2106 1462.7251 1464.3695 1467.8551 1469.6080 1481.6325 1482.7463 1577.4473 1581.4242 2964.5721 2969.6946 2984.7560 3000.9133 3004.8825 3010.3906 3022.1668 3037.1476 3064.8370 3069.2485 3074.8442 3081.2734 3083.0749 3083.5152 3172.4676 3175.4369 3190.6970 3191.6704
redmass: 5.2909 4.8332 5.0818 2.9562 2.9959 3.5871 3.5571 3.7452 3.8093 3.1832 3.4967 3.6608 2.2489 3.0377 4.2571 2.4686 3.8747 3.3052 2.9148 3.4838 4.4412 5.9933 3.9613 5.7287 6.2735 2.8318 1.5200 1.0324 1.0448 3.8156 2.8175 2.6025 3.0383 3.7310 3.5053 3.7689 1.4565 2.1074 1.1890 1.1636 2.1904 1.8492 1.5564 1.3216 1.6851 1.6117 1.8608 1.3784 1.3559 1.6019 1.3863 1.5069 1.5035 1.8952 3.6141 1.3756 1.2761 1.3599 1.3648 1.3537 1.2843 1.5117 1.3426 1.3574 1.5808 1.4880 4.4114 2.9882 1.0812 1.0851 1.0751 1.0758 1.1007 1.1060 1.2612 1.2640 7.3360 8.8845 1.0610 1.0630 1.0830 1.0608 1.0695 1.0815 1.0989 1.0984 1.1029 1.0502 1.0491 1.0580 1.0966 1.0600 1.1185 1.1185 1.1176 1.1173
irintensity: 0.9113 2.3343 7.2405 4.9020 1.4906 2.4437 6.3907 8.8467 3.2712 0.7498 9.4164 9.4036 3.0187 0.3777 6.3677 4.0471 5.0749 0.3601 6.9145 2.2425 9.4330 5.7887 2.7713 18.5091 1.5151 2.9364 0.7969 8.2738 15.6161 2.7016 6.8317 3.7623 4.5688 10.6016 13.3520 4.5444 5.7320 48.9952 2.5819 0.5611 26.4887 5.3253 30.1291 13.1825 10.2984 10.4614 56.9066 9.3607 6.8622 31.0602 14.9865 7.0669 7.9575 1.3609 66.1582 0.9338 6.8046 0.9616 0.9164 2.3268 1.0723 3.8132 3.3995 16.9125 61.8245 25.1726 219.4004 188.7338 0.9357 17.2473 3.2916 2.4120 46.8716 11.9038 26.6709 26.2122 329.3471 200.4181 34.3990 28.3836 14.7159 28.4684 45.7733 33.8038 45.3744 29.0682 20.3806 27.1228 23.9641 34.6594 29.9234 21.0117 3.9712 1.6383 24.1498 26.8837
temp: 298.150 k
press: 1.00000 atm
elementType: 8 8 7 7 6 6 6 6 6 6 6 6 6 6 6 6 1 1 1 1 1 1 1 1 1 1 1 1 1 1 1 1 1 1
symmnumber: 1
zpe: 747797.2 jmol-1
zpe.correction: 0.284821 hartree
zpe.thermalcorrener: 0.299851 hartree
zpe.thermalcorrenthalpy: 0.300795 hartree
zpe.thermalcorrgfe: 0.242155 hartree
zpe.sumelectzpe: -726.707044 hartree
zpe.sumelectthermal: -726.692013 hartree
zpe.sumelectthermalent: -726.691069 hartree
zpe.sumelectthermalfe: -726.749709 hartree
dipole: -6.2825 1.2403 1.4414
dipole: 6.5640
quadrupole: -94.7975 -92.6434 -94.4034
quadrupole: 12.0663 -2.6959 -0.3228
quadrupole: -0.8494 1.3047 -0.4553 12.0663 -2.6959 -0.3228
hfenergy: -726.9918647 hartree
pointgroup: C01 [X(C12H18N2O2)]
dipole: 2.2839356 -1.2018943 0.0906889 debye
polarizability: 177.464375|-11.1287484|132.424076|5.0644475|14.6265157|121.4375365 unknown
InChI: InChI=1S/C12H18N2O2/c15-11(13-5-6-13)9-1-2-10(4-3-9)12(16)14-7-8-14/h9-10H,1-8H2
charge 0 multiplicity 1
34 atoms
O  0.856669 -0.907703 -1.03165
O  -3.769066 1.860539 0.594261
N  3.110023 -0.645465 -0.536655
N  -3.320033 -0.328924 -0.048629
C  1.482338 0.538772 0.892956
C  -1.506436 1.013238 1.026547
C  0.829791 1.867539 0.400206
C  0.577664 -0.113742 1.982004
C  -0.627953 1.686454 -0.075244
C  -0.881329 -0.316726 1.514226
C  1.753112 -0.416231 -0.277218
C  -2.945474 0.901084 0.503605
C  3.772163 -1.850868 -1.054361
C  4.213822 -1.203975 0.27606
C  -4.209321 -0.590261 -1.191925
C  -2.775629 -1.153534 -1.154779
H  2.460784 0.786495 1.347411
H  -1.56152 1.720195 1.879974
H  1.439989 2.309261 -0.410561
H  0.852169 2.581778 1.249149
H  0.593975 0.55644 2.866319
H  1.004501 -1.082666 2.309021
H  -1.062372 2.670347 -0.332669
H  -0.632458 1.062918 -0.987412
H  -0.893086 -1.060085 0.700481
H  -1.485242 -0.727147 2.345693
H  4.395742 -1.719781 -1.944525
H  3.20637 -2.789328 -1.012768
H  3.9549 -1.729697 1.20384
H  5.141405 -0.622521 0.310468
H  -4.42237 0.253727 -1.859226
H  -5.053689 -1.262596 -1.00726
H  -2.621933 -2.215664 -0.93464
H  -2.018202 -0.706774 -1.808501
