program: Gaussian 09
title: 000241002
version: EM64L-G09RevD.01
frameworkgroup: C1[X(C16H14N4O2)]
method: RPBEPBE
basis: SDD
operation: Freq
keyword: #p
keyword: freq=noraman
keyword: PBEPBE/SDD
title: #p freq=noraman PBEPBE/SDD
converged: NO YES NO NO
title: Mulliken charges:
elementType: O O N N N N C C C C C C C C C C C C C C C C H H H H H H H H H H H H H H
charge: -0.270537 -0.276266 -0.008809 -0.014426 0.051142 0.034891 -0.479328 -0.448574 0.250915 0.267640 0.218605 0.185326 -0.292413 -0.317296 -0.346219 -0.352511 -0.330913 -0.323838 -0.233432 -0.235323 -0.209335 -0.207907 0.223717 0.251363 0.229939 0.186676 0.227167 0.221512 0.278095 0.270682 0.255865 0.259109 0.233010 0.233354 0.233998 0.234124
chargesum: 0.00000
title: Mulliken charges with hydrogens summed into heavy atoms:
elementType: O O N N N N C C C C C C C C C C C C C C C C
charge: -0.270537 -0.276266 -0.008809 -0.014426 0.051142 0.034891 -0.004249 -0.031959 0.250915 0.267640 0.218605 0.185326 -0.065247 -0.095784 -0.068125 -0.081829 -0.075048 -0.064730 -0.000422 -0.001968 0.024663 0.026217
polarizability: 3.23370913e+02 -1.18933447e+00 2.57343544e+02 -6.85990132e+00 -3.78789465e+00 1.09479349e+02
1716.lowfreq: -10.1403 -6.1294 -4.6865 -0.0006 -0.0001 0.0006 24.9879 54.6295 67.3483
frequency: 24.9337 54.6132 67.3423 75.8661 93.1704 111.5415 115.3709 133.4075 150.5521 196.3379 205.5850 218.3027 240.6129 283.1146 301.1347 306.7621 324.9994 353.2958 386.3782 431.5169 461.0106 469.7460 474.7433 479.0930 511.5086 520.1506 553.3820 564.0787 574.4765 600.9732 621.9025 632.1459 660.6362 707.9443 737.9319 742.3532 766.1657 768.7157 786.9501 822.0076 835.4831 859.8731 865.3766 873.4700 878.1530 892.2712 946.4212 953.4569 961.4926 982.0142 990.4431 995.1132 1021.5685 1026.8555 1029.6652 1031.6910 1061.7409 1080.9153 1082.6034 1153.9575 1156.7130 1171.2857 1171.9038 1204.1353 1221.7084 1223.6200 1265.7991 1282.7760 1285.5589 1323.3933 1341.3493 1356.2817 1361.2665 1392.8564 1398.7735 1424.8630 1430.8908 1438.4762 1446.0892 1464.4765 1466.2876 1471.2892 1576.5445 1577.7906 1605.1955 1605.8527 1625.0998 1630.8269 2902.4083 2965.2154 2982.9414 3026.1736 3030.8548 3071.3519 3137.4801 3137.9577 3152.2934 3152.5047 3165.7810 3166.9253 3177.0952 3178.3626
redmass: 6.8398 6.1035 5.9620 6.0241 3.7644 4.6832 5.6687 5.0086 6.6198 3.2104 4.6414 4.3055 3.8101 6.1102 4.0927 3.9448 5.2206 3.3645 4.3152 7.3844 4.2666 3.8664 4.3206 4.2579 3.5937 4.0911 3.5229 5.9017 7.6692 9.2468 5.5330 5.2314 8.9367 5.8312 3.3840 3.4680 1.3925 1.4180 4.2888 3.4557 3.2461 3.1132 2.0787 1.4182 4.6268 2.5888 1.9862 1.3975 1.4582 1.5637 1.3809 1.3573 2.4821 2.8915 2.0798 2.1959 2.5264 2.8975 2.7072 1.8480 1.8436 1.1549 1.1534 1.2616 2.1043 1.6836 1.1169 1.6832 1.6446 1.3299 1.3156 1.8486 2.5313 2.7799 2.2517 1.3917 2.4372 2.0019 3.5968 2.6053 1.1163 3.1925 6.5792 6.6586 7.0349 6.8783 6.6653 6.2810 1.0681 1.0858 1.0608 1.0924 1.0986 1.0859 1.0859 1.0860 1.0905 1.0907 1.0956 1.0959 1.0993 1.0990
irintensity: 0.6246 0.0405 2.1939 1.3473 3.6031 1.3015 1.0805 8.5883 0.9118 24.3740 11.0370 5.4012 5.9841 0.2623 4.2664 6.0293 0.8902 1.2178 2.6510 33.8495 0.7112 8.0786 11.1462 20.2062 3.5332 9.2351 3.4422 15.1775 12.3223 135.6997 59.9987 26.5955 18.3892 139.1798 72.7440 21.4566 73.4405 101.2115 25.7602 12.9510 15.7830 1.2452 1.0934 1.2111 49.9370 2.1677 0.6106 5.2229 4.3246 11.3103 1.8474 2.7574 6.2990 26.6999 13.2841 2.1275 5.6191 28.7673 30.3640 5.4171 33.8136 11.8362 3.7698 2.6398 5.0668 7.7260 0.7343 21.0153 13.6142 23.7108 10.1032 21.1478 9.3875 6.0380 6.7206 30.5607 12.5089 58.3479 5.5019 45.2483 19.7544 11.5208 11.7389 2.9145 31.2976 19.5898 36.4892 25.4581 78.9943 48.1440 30.7885 26.2448 27.0272 17.1665 2.0507 2.0707 13.3387 10.9530 16.7576 15.5440 12.6261 9.8554
temp: 298.150 k
press: 1.00000 atm
elementType: 8 8 7 7 7 7 6 6 6 6 6 6 6 6 6 6 6 6 6 6 6 6 1 1 1 1 1 1 1 1 1 1 1 1 1 1
symmnumber: 1
zpe: 707123.2 jmol-1
zpe.correction: 0.269329 hartree
zpe.thermalcorrener: 0.287986 hartree
zpe.thermalcorrenthalpy: 0.288930 hartree
zpe.thermalcorrgfe: 0.222130 hartree
zpe.sumelectzpe: -985.849765 hartree
zpe.sumelectthermal: -985.831108 hartree
zpe.sumelectthermalent: -985.830164 hartree
zpe.sumelectthermalfe: -985.896964 hartree
dipole: 0.2781 0.0298 0.5147
dipole: 0.5858
quadrupole: -105.1299 -117.5335 -131.0178
quadrupole: 1.6719 -2.3168 4.1320
quadrupole: 12.7638 0.3603 -13.1241 1.6719 -2.3168 4.1320
hfenergy: -986.1190937 hartree
pointgroup: C01 [X(C16H14N4O2)]
dipole: 0.1182831 -0.0320983 -0.1951707 debye
polarizability: 322.2815589|4.7867988|254.6249645|15.6689254|-20.4410765|113.2872823 unknown
InChI: InChI=1S/C16H14N4O2/c1-3-7-15-13(5-1)11-17-9-10-18-12-14-6-2-4-8-16(14)22-20-19-21-15/h1-8,11-12H,9-10H2
charge 0 multiplicity 1
36 atoms
O  -1.172793 1.164441 -1.060134
O  1.410398 1.352318 -1.092337
N  -1.722561 -2.524528 0.597913
N  1.598649 -2.429854 0.162399
N  -0.591369 2.411701 -0.419047
N  0.661039 2.503117 -0.416878
C  -0.640512 -3.532282 0.564809
C  0.576154 -3.352994 -0.387263
C  -2.722344 -0.404379 -0.06073
C  2.804583 -0.307306 -0.037816
C  -2.487243 0.913024 -0.546641
C  2.614398 1.063259 -0.372585
C  -1.637556 -1.414035 -0.081388
C  1.806671 -1.30935 -0.474781
C  -4.023482 -0.704736 0.423988
C  3.970733 -0.657445 0.691578
C  -3.485319 1.906441 -0.545847
C  3.537835 2.06134 -0.008672
C  -5.036088 0.274638 0.429438
C  4.907952 0.32842 1.063406
C  -4.767548 1.580079 -0.054702
C  4.693364 1.684257 0.710722
H  -1.132092 -4.496598 0.326843
H  -0.264381 -3.630511 1.602747
H  1.055979 -4.346706 -0.472965
H  0.222465 -3.058471 -1.404658
H  -0.771526 -1.141306 -0.703194
H  1.236878 -1.033875 -1.386663
H  -4.201061 -1.717884 0.798693
H  4.114691 -1.710337 0.954354
H  -3.252149 2.911327 -0.90966
H  3.340267 3.105967 -0.265188
H  -6.033739 0.027946 0.807627
H  5.804968 0.046122 1.624381
H  -5.554431 2.34181 -0.049389
H  5.422574 2.448589 0.999743
