program: Gaussian 09
title: 000240956
version: EM64L-G09RevD.01
frameworkgroup: C1[X(C22H21NO3)]
method: RPBEPBE
basis: SDD
operation: Freq
keyword: #p
keyword: freq=noraman
keyword: PBEPBE/SDD
title: #p freq=noraman PBEPBE/SDD
converged: YES YES NO NO
title: Mulliken charges:
elementType: O O O N C C C C C C C C C C C C C C C C C C C C C C H H H H H H H H H H H H H H H H H H H H H
charge: -0.311784 -0.314075 -0.209629 -0.123209 -0.495766 0.152421 0.215024 -0.556087 0.444293 0.223993 0.502583 -0.462517 -0.370292 -0.341715 0.216075 -0.433952 -0.262993 -0.243360 -0.370098 -0.447668 -0.793583 -0.231220 -0.220983 -0.242038 0.252016 -0.765620 0.245253 0.258215 0.264773 0.247064 0.243446 0.251947 0.253200 0.244903 0.229590 0.232510 0.249617 0.237048 0.267085 0.264715 0.227538 0.226787 0.226810 0.229277 0.307574 0.244035 0.238796
chargesum: 0.00000
title: Mulliken charges with hydrogens summed into heavy atoms:
elementType: O O O N C C C C C C C C C C C C C C C C C C C C C C
charge: -0.311784 -0.314075 -0.209629 -0.123209 0.007701 0.152421 0.215024 -0.044250 0.444293 0.223993 0.502583 -0.219071 -0.118345 -0.088515 0.216075 -0.189049 -0.033403 -0.010850 -0.120481 -0.210620 -0.034245 -0.004433 0.005827 -0.012761 0.252016 0.024786
polarizability: 2.66894891e+02 1.00842935e+01 3.02096775e+02 1.63670623e+01 -1.45492414e+01 1.90803080e+02
1716.lowfreq: -7.7715 -3.4868 -0.0006 0.0003 0.0007 5.1966 12.1132 17.3280 28.9097
frequency: 11.1245 17.0751 28.8820 34.1330 43.1632 61.1549 65.1317 92.0974 109.9701 114.8053 133.9051 146.2417 151.0040 153.8806 168.9019 208.8741 233.1888 260.9945 276.2933 313.3188 326.0001 334.5663 367.5204 389.9867 402.9685 409.8669 435.3306 451.1330 468.2067 504.1924 513.8087 522.8856 528.4237 561.4942 563.6253 588.8215 596.5784 611.9289 617.5431 644.4713 648.2801 705.4849 721.1610 728.6445 744.7636 758.9017 773.9258 780.8434 799.1742 814.7022 826.9732 846.5394 857.2713 876.8043 911.8533 929.9923 945.2718 954.9301 959.5294 973.1725 979.3017 982.2571 990.1955 990.7000 993.4300 997.5609 1025.7975 1035.1504 1037.2358 1044.4243 1053.1079 1065.3079 1094.1972 1146.2658 1155.9107 1171.4601 1172.4290 1176.8296 1185.6130 1192.1651 1200.2934 1213.4619 1235.2937 1238.6592 1274.3226 1282.9307 1313.5079 1321.2874 1346.0731 1359.3216 1380.6234 1383.1485 1389.7302 1406.4966 1418.2936 1426.5860 1430.8655 1441.7363 1445.3966 1450.6587 1459.2445 1461.6319 1470.5666 1474.2656 1477.9573 1485.6694 1517.0473 1579.6595 1591.2445 1594.0290 1603.8729 1613.8007 1631.5062 1672.4230 2979.4087 2988.5811 2990.7342 3000.6448 3032.0871 3059.8012 3075.0775 3088.7518 3116.0621 3121.9486 3125.2118 3131.6738 3134.4315 3135.9558 3138.3951 3138.7148 3145.5573 3155.2668 3162.8760 3168.8198 3173.6442
redmass: 3.8498 5.1982 5.7762 7.6761 4.8861 4.5520 5.3617 4.4578 3.7874 4.1031 4.4482 1.1641 3.4058 1.0426 5.2185 4.1104 3.7017 5.7747 5.1122 4.8340 2.7807 5.3832 3.6445 2.1647 2.8102 3.0960 4.6321 3.0981 4.7575 3.6976 5.2333 4.3559 3.0591 3.4348 3.3267 5.0363 4.8426 4.9953 6.0408 4.4162 4.3050 1.9106 3.4513 4.2464 2.3988 1.4749 3.1451 3.4112 3.5759 3.6778 1.7090 4.1786 1.2489 1.6339 1.6875 3.0712 2.2360 1.5854 1.8620 1.4634 1.3975 1.8131 5.7162 2.1369 1.3461 1.3472 2.1965 1.6691 2.2934 3.5605 1.6323 1.9872 1.6598 2.1327 1.6251 1.3484 1.4153 1.3237 1.1135 1.6001 2.2933 2.6637 2.0320 1.7501 1.7164 1.6449 1.9852 1.3493 1.3924 1.7983 1.2461 6.2812 1.2318 3.0318 2.6474 3.3765 2.8617 1.9656 1.2282 1.0602 1.9581 1.0788 1.0778 1.2231 1.3003 1.8438 3.2658 5.6903 7.9949 6.0986 5.8707 6.0757 6.6633 10.1860 1.0621 1.0388 1.0410 1.0590 1.0976 1.1021 1.0979 1.0924 1.0871 1.0864 1.0864 1.0982 1.0913 1.0893 1.0892 1.1016 1.0961 1.0944 1.1015 1.0993 1.0965
irintensity: 0.0158 0.1008 1.1680 0.7418 0.9469 0.4289 0.1047 2.8699 3.5626 3.9496 10.1905 0.5057 0.4726 0.4736 1.4080 5.2244 10.4040 3.3353 1.0620 1.2060 3.0790 0.7778 3.9526 6.4635 0.2603 3.0755 8.1075 2.4940 4.9101 25.2741 1.4227 1.5103 3.4600 2.3043 6.2930 7.3918 12.4392 3.7106 0.8218 7.5190 1.0823 41.6141 10.1762 35.1739 19.6011 50.3292 16.9548 9.4269 36.0223 13.1911 70.1081 1.8075 0.0510 6.7235 17.4975 36.3028 15.9693 2.8701 5.9879 2.0956 0.0536 8.7221 0.6991 106.9622 1.5493 0.7047 6.7101 7.7349 7.1686 56.0705 10.5975 14.7788 9.0557 242.1502 111.0678 32.9420 33.1996 13.6872 1.6947 18.7482 7.9470 8.1263 4.9485 159.9253 7.1741 12.3724 3.9606 7.3553 5.6400 11.2574 28.4864 11.5408 94.4506 13.7124 101.0132 5.5182 10.8921 12.1159 37.9859 16.0350 16.7180 25.1403 14.9023 21.9505 5.3875 15.4138 23.2458 255.9557 1.8826 3.8980 14.2785 5.8562 6.0579 171.2184 13.9272 7.2401 8.2491 24.7215 6.6087 14.0219 8.2861 3.6141 7.9859 0.9233 1.7420 8.0273 11.5816 4.1315 10.3247 10.4718 36.8365 33.1050 24.9069 24.6532 5.8299
temp: 298.150 k
press: 1.00000 atm
elementType: 8 8 8 7 6 6 6 6 6 6 6 6 6 6 6 6 6 6 6 6 6 6 6 6 6 6 1 1 1 1 1 1 1 1 1 1 1 1 1 1 1 1 1 1 1 1 1
symmnumber: 1
zpe: 981932.5 jmol-1
zpe.correction: 0.373998 hartree
zpe.thermalcorrener: 0.397761 hartree
zpe.thermalcorrenthalpy: 0.398705 hartree
zpe.thermalcorrgfe: 0.317266 hartree
zpe.sumelectzpe: -1129.544256 hartree
zpe.sumelectthermal: -1129.520493 hartree
zpe.sumelectthermalent: -1129.519549 hartree
zpe.sumelectthermalfe: -1129.600989 hartree
dipole: -0.9586 -4.1563 -1.1432
dipole: 4.4160
quadrupole: -148.3354 -151.4840 -144.8701
quadrupole: -0.8842 3.9723 -11.1407
quadrupole: -0.1056 -3.2542 3.3598 -0.8842 3.9723 -11.1407
hfenergy: -1129.9182543 hartree
pointgroup: C01 [X(C22H21N1O3)]
dipole: -0.0169698 -1.7281045 0.1785273 debye
polarizability: 265.7572398|-2.6160034|298.690434|15.9884471|27.7069979|195.3470716 unknown
InChI: InChI=1S/C22H21NO3/c1-16(24)23(14-18-8-4-3-5-9-18)15-21-20-11-7-6-10-19(20)12-13-22(21)26-17(2)25/h3-13H,14-15H2,1-2H3
charge 0 multiplicity 1
47 atoms
O  1.205149 1.664934 1.220452
O  -1.241368 3.469778 -0.777582
O  2.823765 3.067796 0.257806
N  -0.959081 1.185061 -0.440523
C  -0.299355 -0.087406 -0.754475
C  1.096117 -0.36537 -0.168528
C  1.726706 -1.616037 -0.559011
C  -1.801462 1.227187 0.780821
C  3.057245 -1.941608 -0.084316
C  1.812438 0.477106 0.691829
C  -3.008985 0.301457 0.694965
C  3.73695 -1.023496 0.781023
C  1.072522 -2.567893 -1.415726
C  3.123973 0.160448 1.165936
C  -0.726201 2.361837 -1.146267
C  3.673434 -3.172989 -0.479918
C  1.697695 -3.762457 -1.785043
C  3.011138 -4.071911 -1.31743
C  -3.957488 0.450906 -0.350467
C  -3.214497 -0.710733 1.664482
C  0.167858 2.280007 -2.381628
C  -5.08689 -0.392509 -0.421199
C  -4.346584 -1.556553 1.598149
C  -5.285642 -1.400027 0.553991
C  1.813374 2.935398 0.972464
C  1.022152 4.018215 1.660198
H  -0.226853 -0.186887 -1.852858
H  -0.98416 -0.893441 -0.425038
H  -2.119326 2.280426 0.883454
H  -1.175561 0.97236 1.656263
H  4.743421 -1.268192 1.137928
H  0.063186 -2.372164 -1.788563
H  3.627495 0.869772 1.828443
H  4.680965 -3.397083 -0.110169
H  1.175224 -4.470256 -2.438012
H  3.48999 -5.010657 -1.615406
H  -3.807198 1.235116 -1.10234
H  -2.486874 -0.835871 2.476361
H  0.28016 3.29919 -2.778486
H  1.169367 1.878798 -2.14459
H  -0.280244 1.643538 -3.167312
H  -5.815377 -0.263137 -1.229794
H  -4.493124 -2.334424 2.356055
H  -6.163846 -2.053205 0.499777
H  0.105363 4.211779 1.071455
H  1.620763 4.9398 1.707188
H  0.71677 3.701602 2.67064
