program: Gaussian 09
title: 000240935
version: EM64L-G09RevD.01
frameworkgroup: C1[X(C17H18O3)]
method: RPBEPBE
basis: SDD
operation: Freq
keyword: #pfreq=noraman
keyword: PBEPBE/SDD
title: #p freq=noraman PBEPBE/SDD
converged: YES YES NO NO
title: Mulliken charges:
elementType: O O O C C C C C C C C C C C C C C C C C H H H H H H H H H H H H H H H H H H
charge: -0.280007 -0.287051 -0.227807 -0.487756 -0.339999 -0.417718 0.433907 0.360177 0.344563 0.217914 -0.683797 -0.353559 -0.328582 -0.380318 -0.324466 -0.379674 -0.427830 -0.219218 -0.222636 -0.239221 0.243045 0.241635 0.214635 0.220852 0.222918 0.222821 0.208975 0.208574 0.223680 0.254808 0.251248 0.257428 0.300941 0.258352 0.229604 0.226912 0.227367 0.229283
chargesum: 0.00000
title: Mulliken charges with hydrogens summed into heavy atoms:
elementType: O O O C C C C C C C C C C C C C C C C C
charge: -0.280007 -0.287051 -0.227807 -0.003076 0.095488 0.028020 0.433907 0.360177 0.344563 0.217914 -0.042568 -0.098751 -0.077334 -0.122890 -0.023525 -0.121322 -0.198227 0.007694 0.004731 -0.009938
polarizability: 3.21851962e+02 -2.17595169e+00 1.78847754e+02 4.15896503e+00 5.56229919e+00 1.01501667e+02
1716.lowfreq: -5.7650 -1.9464 -0.0007 -0.0005 0.0012 9.3068 15.4469 17.2760 20.9596
frequency: 15.3848 17.2254 20.6914 32.7383 42.0916 49.0897 83.2409 87.3377 109.7735 138.1713 179.7580 208.0175 224.2535 231.8943 259.5982 307.3178 339.8452 363.5870 368.7444 401.5230 417.4889 445.0078 488.2155 514.3927 518.2446 538.3338 601.0958 616.1270 621.4367 697.1185 702.2908 713.9573 728.5993 735.2142 747.4867 803.0051 815.2103 832.2009 835.3552 855.2983 866.1565 875.0104 913.6049 927.8190 952.2697 964.4441 974.3919 978.7207 990.1116 996.0122 999.6199 1012.1688 1027.5889 1053.3992 1086.3123 1091.0868 1101.1243 1113.7338 1125.9601 1153.6557 1172.6261 1183.2328 1187.0371 1204.0518 1219.4690 1223.3239 1231.1028 1283.0908 1289.6798 1298.0883 1315.3023 1356.5231 1358.5428 1378.3286 1390.7768 1394.0099 1421.2481 1437.8353 1440.4733 1469.6870 1472.3906 1479.6325 1485.2123 1485.6173 1489.9989 1587.7267 1596.1378 1616.1988 1619.0341 1645.7060 2937.1820 2973.9428 2985.5413 2999.2577 3003.4906 3031.7822 3051.6876 3077.3148 3078.1552 3116.2187 3128.4891 3142.1819 3157.0456 3157.7746 3163.4142 3169.4280 3177.7118 3209.6196
redmass: 4.4939 3.0099 2.0481 5.1057 4.2878 5.8986 4.2840 3.4121 3.6250 5.3281 6.0863 4.5757 4.4064 1.0771 3.6069 5.3437 5.2229 3.6072 6.8785 2.8278 3.1062 3.5107 3.5770 4.4130 3.2273 2.9040 6.0415 6.4703 6.9317 5.4860 2.2663 3.7287 3.6042 1.1995 1.8007 5.6656 1.2649 4.3007 1.6294 1.2504 1.3211 3.1611 1.3450 2.5584 1.3325 1.3290 6.5985 1.4226 6.0442 1.3461 2.7480 1.7293 2.1417 2.4022 1.5671 2.7142 1.7531 1.3256 2.4469 2.1774 1.0544 1.4710 1.1284 1.2102 1.3394 2.2616 3.3890 1.1794 1.3414 1.2901 1.3648 1.7652 1.6781 6.3084 3.7694 1.2141 3.7083 1.0894 2.1365 1.2434 1.0573 1.0424 1.6394 1.3463 1.9525 7.8914 6.1953 6.3755 6.0969 10.0193 1.0578 1.0361 1.0623 1.1028 1.0608 1.0971 1.1002 1.0994 1.1016 1.0874 1.0869 1.0925 1.0882 1.0963 1.0899 1.0996 1.0975 1.0944
irintensity: 0.2531 0.6463 0.2020 2.3112 0.2112 0.7867 0.3840 2.2241 0.7627 1.7540 7.8697 3.0063 2.5595 0.0078 1.6675 9.8527 4.3416 0.1795 0.0346 0.9211 0.0487 4.1231 9.1935 7.5973 13.1795 0.4380 9.0314 0.2318 2.9896 1.9042 37.4846 0.0521 28.5614 8.2201 59.5479 3.3465 6.0307 13.7425 93.0320 0.3249 0.0244 1.4631 6.7151 60.0011 2.4709 1.0980 110.7078 4.2290 0.2691 0.9522 22.6020 3.7459 10.3597 48.0812 14.8648 289.7056 63.7602 15.3803 353.5632 129.0695 0.3717 247.3051 7.1434 7.9141 2.5122 6.0767 88.3633 16.5332 44.5678 0.0970 12.6506 11.0726 39.5865 6.7711 13.9331 8.1939 1.9414 24.9937 16.6556 152.7197 2.8445 13.0963 29.6403 16.2277 172.8325 11.6490 0.8177 43.9765 0.8681 176.5914 27.1002 39.9543 6.8439 29.2370 21.9686 1.9123 0.1481 51.8796 74.4672 8.9793 0.6922 27.6175 9.2467 32.0725 14.3357 12.0370 3.5762 4.3607
temp: 298.150 k
press: 1.00000 atm
elementType: 8 8 8 6 6 6 6 6 6 6 6 6 6 6 6 6 6 6 6 6 1 1 1 1 1 1 1 1 1 1 1 1 1 1 1 1 1 1
symmnumber: 1
zpe: 802705.5 jmol-1
zpe.correction: 0.305734 hartree
zpe.thermalcorrener: 0.325045 hartree
zpe.thermalcorrenthalpy: 0.325989 hartree
zpe.thermalcorrgfe: 0.253101 hartree
zpe.sumelectzpe: -882.820741 hartree
zpe.sumelectthermal: -882.801430 hartree
zpe.sumelectthermalent: -882.800486 hartree
zpe.sumelectthermalfe: -882.873375 hartree
dipole: -0.2386 0.3497 0.0882
dipole: 0.4325
quadrupole: -95.6938 -112.2163 -121.5916
quadrupole: 10.1223 -1.6861 2.9238
quadrupole: 14.1401 -2.3824 -11.7577 10.1223 -1.6861 2.9238
hfenergy: -883.1264756 hartree
pointgroup: C01 [X(C17H18O3)]
dipole: 0.0925533 0.0237686 0.1407718 debye
polarizability: 321.4494892|-9.4837423|101.4332798|3.8554858|0.4861905|179.3186133 unknown
InChI: InChI=1S/C17H18O3/c1-2-6-17(18)20-16-11-9-15(10-12-16)19-13-14-7-4-3-5-8-14/h3-5,7-12H,2,6,13H2,1H3
charge 0 multiplicity 1
38 atoms
O  2.036406 -0.208182 0.478298
O  -3.598619 -0.019393 0.622044
O  -4.268579 0.581968 -1.555205
C  -5.939843 0.201903 0.231921
C  -7.064056 0.348183 -0.813231
C  2.813054 0.104369 -0.734276
C  4.288437 0.037361 -0.393288
C  0.637472 -0.126025 0.38932
C  -2.178841 -0.025361 0.436099
C  -4.548412 0.286288 -0.374189
C  -8.461639 0.297467 -0.161995
C  -0.062227 -0.406741 1.59088
C  -0.082076 0.201768 -0.78485
C  -1.464474 -0.356074 1.612703
C  -1.496265 0.254738 -0.767631
C  4.761614 0.430671 0.882791
C  5.217259 -0.38018 -1.377823
C  6.145365 0.411191 1.165214
C  6.602624 -0.390637 -1.098446
C  7.070986 0.005787 0.175174
H  -6.02379 -0.756778 0.778758
H  -6.021227 0.993099 1.004519
H  -6.967098 -0.454538 -1.568294
H  -6.930601 1.2995 -1.360541
H  2.535644 1.123749 -1.080708
H  2.562997 -0.615546 -1.540124
H  -8.622884 -0.658884 0.370671
H  -8.593218 1.116367 0.570447
H  -9.256837 0.39648 -0.922655
H  0.509728 -0.661972 2.487618
H  0.433124 0.41648 -1.725283
H  -2.022187 -0.569394 2.52924
H  -2.049644 0.507203 -1.672229
H  4.04027 0.730483 1.649205
H  4.860308 -0.701997 -2.364437
H  6.501941 0.71173 2.15692
H  7.311561 -0.715648 -1.868115
H  8.144227 -0.007035 0.3957
