program: Gaussian 09
title: 000240947
version: EM64L-G09RevD.01
frameworkgroup: C1[X(C19H18Cl2N2O2)]
method: RPBEPBE
basis: SDD
operation: Freq
keyword: #p
keyword: freq=noraman
keyword: PBEPBE/SDD
title: #p freq=noraman PBEPBE/SDD
converged: YES YES NO NO
title: Mulliken charges:
elementType: Cl Cl O O N N C C C C C C C C C C C C C C C C C C C H H H H H H H H H H H H H H H H H H
charge: -0.017185 -0.050557 -0.281326 -0.212238 -0.074927 -0.409961 -0.532710 0.411975 -0.481184 0.106011 0.232538 -0.423872 0.421154 -0.632114 -0.431668 -0.350754 0.346838 -0.415239 -0.254229 -0.218929 -0.259742 -0.106300 -0.255567 0.300150 -0.765981 0.189708 0.221908 0.175771 0.255611 0.271183 0.307267 0.264582 0.225220 0.181064 0.248684 0.227990 0.270464 0.223965 0.223785 0.282348 0.298940 0.237791 0.249534
chargesum: 0.00000
title: Mulliken charges with hydrogens summed into heavy atoms:
elementType: Cl Cl O O N N C C C C C C C C C C C C C C C C C C C
charge: -0.017185 -0.050557 -0.281326 -0.212238 -0.074927 -0.102694 -0.121094 0.411975 -0.049802 0.106011 0.232538 -0.152689 0.421154 0.038752 -0.182984 -0.122764 0.346838 -0.144775 -0.030264 0.004856 -0.259742 -0.106300 0.026781 0.300150 0.020284
polarizability: 3.05769155e+02 4.73773805e+01 2.50981397e+02 -1.04841986e+01 1.20472064e+01 1.77112355e+02
1716.lowfreq: -10.6600 -7.9920 -5.5805 -0.1710 -0.0014 -0.0011 -0.0008 21.4173 29.4037
frequency: -3.4599 21.3083 29.3900 44.8033 51.8966 66.8564 73.2705 83.6882 96.2806 108.4859 137.3329 145.4248 162.9659 181.5501 204.3434 217.5198 219.2897 242.2887 247.2705 278.2879 284.4230 301.8803 331.7897 350.9230 360.0233 390.7853 421.7705 424.9204 448.5148 453.7654 503.9235 517.3710 521.2298 537.6341 541.7659 558.1162 575.7517 586.9686 592.4552 625.1612 644.3202 684.4065 737.6140 748.2375 752.5981 753.2652 774.9762 782.9257 804.3275 825.6151 854.1194 856.6141 860.7144 866.9280 880.8678 908.7830 936.2016 961.0773 974.5295 976.1690 987.4977 997.4801 1010.5329 1040.4117 1067.3443 1085.6240 1096.6227 1111.6490 1118.8128 1133.3324 1137.1657 1166.8070 1168.9971 1176.2324 1200.7508 1225.7364 1237.5131 1243.6682 1260.2625 1264.4102 1298.1362 1349.1344 1359.4645 1361.5318 1368.3140 1384.4722 1392.0460 1396.6438 1421.6434 1434.0518 1438.0833 1451.7364 1455.8677 1458.1198 1461.7046 1462.7237 1472.3318 1474.6353 1482.8552 1560.6253 1568.9306 1586.6367 1592.2146 1631.8384 1694.8674 2823.9908 2835.2405 2861.0982 3007.0131 3020.0297 3024.2148 3041.7214 3098.8818 3101.1062 3124.9040 3132.7731 3140.5207 3146.2713 3161.7787 3163.3686 3186.7478 3217.3588 3611.4052
redmass: 5.8217 5.0435 7.3105 7.6401 5.4241 6.8751 5.2210 3.9707 3.4476 1.1717 5.1109 6.7271 7.5519 10.2524 1.3767 3.9017 3.9969 4.1099 2.3056 6.2746 3.0476 6.7415 2.7873 4.1430 3.8187 6.1947 4.5699 3.2479 4.0900 3.2359 4.1751 1.4073 2.8903 5.6633 5.3950 4.1471 3.2268 4.0000 4.8330 4.3639 4.0506 5.6040 3.8753 6.1196 1.7739 2.7893 3.4859 7.4013 2.2848 2.3752 6.6484 1.4825 1.4212 5.1789 1.5644 4.4630 1.3786 2.0271 1.2955 1.7520 2.1953 2.5854 2.1217 1.6367 3.5081 2.0071 1.5915 1.3944 2.4284 1.6514 2.7035 1.1376 3.0738 1.6807 1.9312 1.5013 2.0070 2.5664 1.4647 1.4106 2.0948 1.6764 1.5343 1.4976 6.9563 1.2418 4.9408 3.4731 2.3265 1.3169 2.5031 1.0554 1.0601 3.0949 1.1785 1.0938 1.0782 1.0647 2.9787 6.0666 7.8763 6.1278 8.7728 6.9057 10.5019 1.0720 1.0698 1.0579 1.0371 1.0867 1.0851 1.0735 1.0957 1.1003 1.0849 1.0892 1.1017 1.0954 1.0926 1.1001 1.0936 1.0983 1.0810
irintensity: 0.1316 0.0242 0.0485 0.2271 0.3275 1.5186 0.1483 0.2528 7.7802 0.6023 2.0237 2.5484 0.6635 1.8426 0.0786 0.7197 9.0093 0.3980 1.4969 3.9681 0.6053 0.4591 3.7485 1.0199 1.4297 6.0523 9.4329 14.9641 0.9277 6.5888 1.7700 67.9802 23.5491 1.3314 6.2895 9.1410 6.6910 11.3010 5.5449 1.5963 6.3559 9.2010 26.5911 51.6957 78.6151 41.6230 10.7301 55.9263 34.0602 21.8233 32.2671 0.3565 30.9859 1.6837 20.0447 28.4817 4.7513 26.0539 0.1191 1.3945 56.6414 51.5641 9.1046 11.3082 5.5565 14.9106 46.7973 4.7992 61.5349 52.0109 234.2998 2.5401 80.7371 15.5344 4.8455 9.5174 4.9412 9.1033 13.4325 6.8784 1.8888 31.7606 6.5601 19.8245 5.6429 37.3842 43.0721 27.6538 4.4613 27.7251 82.9457 21.4984 11.1990 14.6398 11.8140 1.9340 16.7323 15.3857 1.5954 22.6814 48.7210 0.9202 28.6405 2.6927 148.1241 50.9610 80.9885 187.3653 9.3398 15.2839 11.5271 22.2966 5.1331 25.6608 1.0536 5.0904 8.7731 33.1173 0.6548 25.3790 1.2672 0.8508 64.2750
temp: 298.150 k
press: 1.00000 atm
elementType: 17 17 8 8 7 7 6 6 6 6 6 6 6 6 6 6 6 6 6 6 6 6 6 6 6 1 1 1 1 1 1 1 1 1 1 1 1 1 1 1 1 1 1
symmnumber: 1
zpe: 858402.0 jmol-1
zpe.correction: 0.326948 hartree
zpe.thermalcorrener: 0.349965 hartree
zpe.thermalcorrenthalpy: 0.350909 hartree
zpe.thermalcorrgfe: 0.273102 hartree
zpe.sumelectzpe: -1913.091179 hartree
zpe.sumelectthermal: -1913.068162 hartree
zpe.sumelectthermalent: -1913.067218 hartree
zpe.sumelectthermalfe: -1913.145025 hartree
dipole: 3.8338 -2.7694 -2.6559
dipole: 5.4241
quadrupole: -158.6188 -150.9727 -154.3115
quadrupole: 0.6558 -9.4749 2.9595
quadrupole: -3.9845 3.6617 0.3228 0.6558 -9.4749 2.9595
hfenergy: -1913.4181269 hartree
pointgroup: C01 [X(C19H18Cl2N2O2)]
dipole: 1.5012156 0.892647 1.2262055 debye
polarizability: 307.5017376|-47.1781114|241.8627529|-0.2567831|25.5764315|184.4984161 unknown
InChI: InChI=1S/C19H18Cl2N2O2/c1-12(24)25-19-13(7-15(20)8-17(19)21)10-23(2)11-14-9-22-18-6-4-3-5-16(14)18/h3-9,22H,10-11H2,1-2H3
charge 0 multiplicity 1
43 atoms
Cl -3.526853 -3.226805 0.175547
Cl -6.224519 1.599892 0.667181
O  -1.045791 -1.467644 0.276471
O  -1.142143 -1.672052 -2.061747
N  -0.139427 1.415812 -0.823458
N  3.428203 1.315784 2.117823
C  1.107834 2.235948 -0.680283
C  2.129899 1.661612 0.264866
C  -0.905339 1.432548 0.453147
C  3.099374 0.619363 -0.032989
C  3.900567 0.422198 1.147631
C  2.37081 2.062005 1.58019
C  -2.222132 0.674672 0.406856
C  -0.941974 1.879943 -1.980037
C  3.38436 -0.150174 -1.192523
C  4.955613 -0.515452 1.200635
C  -2.258547 -0.738969 0.298192
C  -3.446359 1.37639 0.523138
C  4.440793 -1.081207 -1.149521
C  5.215387 -1.264914 0.034986
C  -3.496364 -1.418602 0.297651
C  -4.663718 0.672028 0.519691
C  -4.719011 -0.728889 0.407314
C  -0.548341 -1.907618 -0.998573
C  0.734788 -2.663682 -0.788772
H  0.850511 3.279688 -0.360331
H  1.551889 2.314158 -1.690596
H  -1.129098 2.487227 0.765583
H  -0.251906 0.989456 1.227294
H  1.87112 2.830669 2.16796
H  3.801801 1.416379 3.058789
H  -1.802056 1.208834 -2.132807
H  -0.320164 1.838983 -2.891017
H  -1.321693 2.926842 -1.861806
H  2.788887 -0.023069 -2.103499
H  5.556392 -0.657759 2.10597
H  -3.440421 2.466548 0.611568
H  4.674774 -1.678761 -2.037652
H  6.028204 -1.999592 0.037154
H  -5.669453 -1.267267 0.406403
H  1.539714 -1.955903 -0.523466
H  1.010975 -3.190783 -1.713586
H  0.627912 -3.377937 0.043822
