program: Gaussian 09
title: 000240911
version: EM64L-G09RevD.01
frameworkgroup: C1[X(C10H24N2O2)]
method: RPBEPBE
basis: SDD
operation: Freq
keyword: #p
keyword: freq=noraman
keyword: PBEPBE/SDD
title: #p freq=noraman PBEPBE/SDD
converged: YES YES NO NO
title: Mulliken charges:
elementType: O O N N C C C C C C C C C C H H H H H H H H H H H H H H H H H H H H H H H H
charge: -0.305608 -0.465464 -0.318245 -0.580863 -0.086110 -0.387961 -0.402023 -0.270363 -0.343551 -0.243900 -0.350283 -0.320801 -0.392014 -0.693076 0.190087 0.209051 0.203049 0.225485 0.212875 0.191912 0.218391 0.184475 0.186064 0.187021 0.183399 0.197098 0.196944 0.239329 0.209665 0.195871 0.203376 0.193534 0.209616 0.209645 0.217660 0.356574 0.276906 0.262232
chargesum: 0.00000
title: Mulliken charges with hydrogens summed into heavy atoms:
elementType: O O N N C C C C C C C C C C
charge: -0.305608 -0.108890 -0.078916 -0.041725 0.103978 0.024139 0.036336 0.139940 0.026988 0.126520 0.043759 0.084735 0.004897 -0.056154
polarizability: 1.72642781e+02 3.08655692e+00 1.19349573e+02 -7.73642596e-01 1.01795954e+00 1.08685940e+02
1716.lowfreq: -13.7498 -4.7570 -0.0012 -0.0006 0.0010 3.7566 20.7332 27.2991 38.5421
frequency: 20.4833 27.2306 38.2232 56.9320 58.0678 68.4027 89.9349 99.6455 111.7778 126.8226 146.3592 154.0617 157.1553 185.2863 215.8039 222.0953 264.7393 280.9349 302.8166 379.2600 395.5276 455.6537 474.0482 506.7917 515.0760 556.2468 591.4428 712.2776 732.1999 768.9383 804.3054 850.6319 854.3425 878.7395 903.4530 936.4661 956.7854 968.9449 1011.7821 1014.6054 1044.3957 1051.8894 1061.0588 1072.5446 1074.0010 1077.8732 1097.5801 1113.6743 1125.6512 1142.1307 1144.1200 1159.8830 1198.6111 1203.2717 1237.7527 1244.3636 1248.8982 1257.7817 1259.2605 1279.5397 1281.8735 1291.0383 1301.1285 1305.4076 1323.0634 1335.0090 1356.0991 1364.4176 1388.0106 1390.0037 1398.2756 1410.1265 1451.8526 1460.1075 1467.7859 1469.3539 1476.5362 1477.6817 1479.1002 1485.8421 1487.5863 1491.9942 1494.6868 1642.6354 2898.3956 2904.3931 2913.5543 2915.4645 2926.9944 2943.9440 2955.1795 2964.2459 2970.2383 2972.5227 2987.0072 2988.0827 2995.7108 3015.6868 3021.5202 3024.0468 3027.5089 3054.0136 3069.3412 3072.4660 3410.0558 3468.9645 3513.5964 3596.7047
redmass: 4.2880 2.9506 1.7652 1.8747 4.0589 2.8646 3.4493 1.9746 2.6905 2.7337 2.8523 2.8437 3.0368 2.2217 1.2834 1.1273 3.4179 3.8143 4.4749 3.1061 3.2610 2.7232 1.8884 1.4022 3.5960 3.1485 1.3644 1.2621 1.0702 1.1076 1.1090 1.2122 2.4074 2.3250 1.8140 3.2048 1.7721 1.1560 2.5029 3.4970 4.2630 2.6426 2.3788 2.5914 1.6439 2.7630 2.3019 2.4411 2.3120 1.3663 3.3746 1.4962 1.4546 1.4120 1.4378 1.2181 1.2812 1.2096 1.1839 1.0908 1.0997 1.0916 1.2296 1.2028 1.3567 1.2789 1.5915 1.3883 1.3781 1.2917 1.4870 1.7945 1.2100 1.0898 1.0698 1.0739 1.0426 1.0679 1.0828 1.0787 1.0822 1.0904 1.0853 1.0936 1.0682 1.0697 1.0666 1.0552 1.0809 1.0612 1.0589 1.1055 1.0582 1.0375 1.0892 1.0594 1.0989 1.0964 1.0965 1.1031 1.0965 1.1044 1.1010 1.0992 1.0735 1.0451 1.0648 1.0979
irintensity: 0.0631 0.7512 0.1238 0.5311 0.0116 0.3171 1.8468 3.0314 4.7677 1.6258 1.2648 13.4901 1.4065 11.5622 43.2221 0.0159 1.8913 12.1715 1.5857 3.7415 2.7536 2.2441 40.1277 126.4648 19.0980 5.1724 241.5292 105.5360 10.8727 0.0324 2.6386 2.4195 3.7404 2.9653 12.0935 31.7228 2.8826 2.3812 12.1517 3.4584 88.1891 80.4253 29.1816 57.6385 7.3937 34.5663 1.5586 15.2965 8.3428 7.0399 49.8141 4.8125 8.1699 6.4325 4.1850 12.8562 3.2823 13.8876 21.0544 0.2029 1.8866 0.4917 6.7373 17.3645 10.8147 2.4575 0.7726 5.5419 5.7358 7.5155 10.7562 21.4100 28.8321 10.7495 0.0441 1.4381 12.6005 2.3587 4.0532 2.5756 5.3349 17.8701 6.4920 40.9528 8.0083 36.9426 231.5098 42.4286 26.2606 70.4738 17.8692 42.6889 51.4249 32.5714 2.3499 52.3290 2.0976 84.9822 17.6027 10.0683 73.0362 51.3538 110.7349 53.0807 2.2928 0.5778 22.1176 0.5645
temp: 298.150 k
press: 1.00000 atm
elementType: 8 8 7 7 6 6 6 6 6 6 6 6 6 6 1 1 1 1 1 1 1 1 1 1 1 1 1 1 1 1 1 1 1 1 1 1 1 1
symmnumber: 1
zpe: 888991.8 jmol-1
zpe.correction: 0.338599 hartree
zpe.thermalcorrener: 0.357628 hartree
zpe.thermalcorrenthalpy: 0.358572 hartree
zpe.thermalcorrgfe: 0.288136 hartree
zpe.sumelectzpe: -654.171041 hartree
zpe.sumelectthermal: -654.152011 hartree
zpe.sumelectthermalent: -654.151067 hartree
zpe.sumelectthermalfe: -654.221504 hartree
dipole: 0.7173 -3.4201 0.0205
dipole: 3.4946
quadrupole: -83.1912 -93.2138 -85.0133
quadrupole: 10.1022 1.9472 -1.5351
quadrupole: 3.9482 -6.0743 2.1262 10.1022 1.9472 -1.5351
hfenergy: -654.5096397 hartree
pointgroup: C01[X(C10H24N2O2)]
dipole: 0.2998665 1.3161107 -0.2611188 debye
polarizability: 172.5597965|-3.6457451|119.4426842|1.0665306|-1.0194941|108.6758137 unknown
InChI: InChI=1S/C10H24N2O2/c1-2-3-4-7-14-9-10(13)8-12-6-5-11/h10,12-13H,2-9,11H2,1H3
charge 0 multiplicity 1
38 atoms
O  1.036921 -0.484835 0.34434
O  -0.71725 -2.612522 0.282143
N  -3.317991 0.064764 0.375346
N  -6.538548 1.841986 -0.515905
C  -1.219341 -1.254693 0.534638
C  3.428994 -0.080339 0.255368
C  -2.671092 -1.223571 0.034996
C  -0.321635 -0.230015 -0.168337
C  4.595291 0.727764 -0.358437
C  2.067501 0.329299 -0.313553
C  5.975098 0.299312 0.191981
C  -4.658729 0.254751 -0.223679
C  -5.210239 1.658269 0.09994
C  7.141173 1.108664 -0.414948
H  -1.190637 -1.044157 1.628626
H  3.411419 0.05666 1.353978
H  3.581516 -1.161612 0.069736
H  -3.193538 -2.116648 0.452258
H  -2.674048 -1.337624 -1.066013
H  -0.344247 -0.391227 -1.268777
H  -0.650428 0.803537 0.058373
H  4.592367 0.608844 -1.462385
H  4.445039 1.809771 -0.160497
H  1.868085 1.407839 -0.123898
H  2.032961 0.162584 -1.414263
H  5.977792 0.412554 1.295127
H  6.127021 -0.780482 -0.009926
H  -3.352886 0.19871 1.39735
H  -5.410733 -0.501849 0.103057
H  -4.553805 0.148621 -1.322922
H  -4.444755 2.408947 -0.207154
H  -5.331063 1.75284 1.197846
H  7.173602 0.993203 -1.514943
H  7.032937 2.187532 -0.1945
H  8.115992 0.778074 -0.011831
H  0.269868 -2.562068 0.391553
H  -7.089542 2.612871 -0.130216
H  -6.529368 1.848647 -1.54017
