program: Gaussian 09
title: 000240897
version: EM64L-G09RevD.01
frameworkgroup: C1[X(C4H4BrN3O2)]
method: RPBEPBE
basis: SDD
operation: Freq
keyword: #p
keyword: freq=noraman
keyword: PBEPBE/SDD
title: #p freq=noraman PBEPBE/SDD
converged: NO NO NO NO
title: Mulliken charges:
elementType: Br O O N N N C C C C H H H H
charge: 0.049668 -0.369015 -0.243716 -0.416821 -0.055502 -0.612654 0.206365 0.284857 -0.493582 0.274078 0.334903 0.360375 0.326769 0.354275
chargesum: 0.00000
title: Mulliken charges with hydrogens summed into heavy atoms:
elementType: Br O O N N N C C C C
charge: 0.049668 -0.014740 -0.243716 -0.081917 -0.055502 0.074490 0.206365 0.284857 -0.493582 0.274078
polarizability: 1.39137563e+02 2.96608036e+00 9.58575222e+01 -2.05354018e-02 -3.48120929e-03 3.28711907e+01
1716.lowfreq: -9.2339 -4.4259 -0.0008 -0.0005 0.0004 4.6615 76.3263 167.1480 170.0383
frequency: 76.3221 167.1476 170.0379 193.7103 244.8637 279.5283 317.5150 326.7866 379.9467 508.1756 527.0090 533.1490 566.1076 590.6984 628.9653 636.2529 668.4158 703.9261 745.0540 946.6597 975.3828 1027.0439 1097.0107 1200.0477 1218.6983 1316.3829 1405.3665 1480.7209 1519.8347 1582.9624 1630.1670 1658.1468 3463.4989 3505.6605 3555.4525 3706.0422
redmass: 7.4974 6.2653 11.8153 6.7033 16.6133 6.5652 3.5311 1.1447 7.0220 10.5819 1.1167 1.1403 7.6657 4.7301 2.0154 7.4086 5.3654 3.1102 7.4046 6.3908 3.0655 3.2643 2.8795 7.0769 1.5719 1.6162 5.8644 4.8115 7.9019 2.1508 1.8885 5.9749 1.0645 1.0778 1.0458 1.1053
irintensity: 5.0875 2.7261 0.3404 8.4868 1.5103 4.8051 5.0878 75.1503 18.6359 2.2862 0.6943 388.0872 17.8220 7.9599 48.9226 7.7886 17.8976 5.2867 91.0709 57.3219 9.2637 38.3597 79.0396 3.4773 167.4151 40.4020 85.1319 30.6290 216.6203 242.6304 724.6406 462.1137 54.8488 29.6686 137.7253 52.4738
temp: 298.150 k
press: 1.00000 atm
elementType: 35 8 8 7 7 7 6 6 6 6 1 1 1 1
symmnumber: 1
zpe: 236577.6 jmol-1
zpe.correction: 0.090108 hartree
zpe.thermalcorrener: 0.099371 hartree
zpe.thermalcorrenthalpy: 0.100315 hartree
zpe.thermalcorrgfe: 0.054843 hartree
zpe.sumelectzpe: -482.269044 hartree
zpe.sumelectthermal: -482.259781 hartree
zpe.sumelectthermalent: -482.258837 hartree
zpe.sumelectthermalfe: -482.304309 hartree
dipole: -5.2592 -0.2566 0.0015
dipole: 5.2655
quadrupole: -37.5300 -77.8803 -68.7639
quadrupole: -13.3481 -0.0017 0.0062
quadrupole: 23.8614 -16.4889 -7.3725 -13.3481 -0.0017 0.0062
hfenergy: -482.3591519 hartree
pointgroup: C01 [X(C4H4Br1N3O2)]
dipole: 2.0713805 -0.0298635 -0.0006049 debye
dipolederiv: -0.6123033 0.023766 0.0002003 -0.0064674 -0.0826873 0.0000774 0.0004427 0.000001 0.0285008 -0.4277461 -0.471683 0.0000554 -0.3838073 -1.1656914 0.000063 -0.0001207 0.0003866 -0.4083119 -0.4882466 0.2629801 -0.0003933 0.2817474 -1.2478166 0.0005998 0.0002273 -0.0015507 -0.3658237 -0.8930223 0.3165131 0.0002851 0.1578807 -0.6290743 -0.0000326 -0.0004334 -0.0000088 -0.291472 -1.6093902 -0.1030828 -0.0000037 -0.6058108 -0.6249704 -0.0002049 -0.0000877 -0.0001949 -0.2812171 -1.7254906 0.0034702 -0.0001108 -0.0703706 -0.2118257 -0.0000287 -0.0004054 0.0000665 -0.7376839 2.1619547 0.0281893 0.0002209 0.5845298 0.9386303 0.0001774 0.0004084 -0.0000133 0.2989507 0.7786618 -0.2952554 0.0003381 -0.2487527 1.6886807 -0.0005595 0.0004698 0.0011918 0.2631831 0.6820057 0.0212571 -0.000616 0.2145629 -1.107213 0.0000586 -0.0007858 0.0003001 -0.2661465 1.2439717 0.1645565 0.000164 0.0400925 1.5052536 -0.0001811 0.0002389 -0.0002747 0.2437446 0.1247925 0.0148222 -0.0000855 -0.00681 0.1601849 -0.0000067 -0.0001037 0.0000235 0.3453945 0.2867199 -0.0409171 -0.0000324 -0.0868634 0.197598 -0.0000225 0.0000428 0.0000096 0.4034864 0.2666685 0.013042 -0.0000326 0.0616056 0.1453605 0.0000268 0.0000572 0.0000144 0.4047294 0.2114243 0.0623417 0.0000104 0.0684632 0.4335708 0.0000331 0.0000496 0.0000488 0.3626655 unknown
polarizability: 139.290092|-1.4740808|95.7049934|-0.0206428|0.0027741|32.8711907 unknown
InChI: InChI=1S/C4H4BrN3O2/c5-1-2(9)7-4(6)8-3(1)10/h7,10H,6H2
charge 0 multiplicity 1
14 atoms
Br -3.031702 -0.04988 0.000935
O  -0.894438 -2.425073 0.000261
O  -0.976244 2.464242 0.000764
N  0.997849 1.206238 -0.000257
N  1.046701 -1.181553 -0.000332
N  3.051148 0.006822 0.000271
C  1.676353 0.002231 -0.000123
C  -0.450243 1.317217 -0.001277
C  -1.081872 0.015207 -0.000297
C  -0.324609 -1.167458 -0.000248
H  1.481925 2.109895 0.000006
H  3.512272 -0.90069 0.000289
H  3.606897 0.857212 0.000328
H  -1.887838 -2.343209 0.000479
