program: Gaussian 09
title: 000240900
version: EM64L-G09RevD.01
frameworkgroup: C1[X(C14H17ClN4O)]
method: RPBEPBE
basis: SDD
operation: Freq
keyword: #p
keyword: freq=noraman
keyword: PBEPBE/SDD
title: #p freq=noraman PBEPBE/SDD
converged: YES YES NO NO
title: Mulliken charges:
elementType: Cl O N N N N C C C C C C C C C C C C C C H H H H H H H H H H H H H H H H H
charge: -0.056201 -0.333459 -0.463161 -0.138357 -0.006126 -0.588114 0.369543 0.135830 -0.519192 0.259159 0.174138 -0.339699 -0.674152 -0.301717 -0.329687 -0.240627 -0.254391 -0.026928 -0.232347 -0.685118 0.242883 0.201141 0.372524 0.218553 0.218054 0.237697 0.308292 0.242727 0.222383 0.224237 0.213373 0.213660 0.214460 0.230683 0.229489 0.335010 0.325441
chargesum: 0.00000
title: Mulliken charges with hydrogens summed into heavy atoms:
elementType: Cl O N N N N C C C C C C C C C C C C C C
charge: -0.056201 -0.333459 -0.090637 -0.138357 -0.006126 0.072337 0.369543 0.135830 -0.075169 0.259159 0.174138 -0.339699 0.000152 0.006575 -0.086960 -0.018244 -0.030154 -0.026928 0.194687 -0.010486
polarizability: 2.98966802e+02 1.09432381e+01 2.47446016e+02 2.09295352e+00 4.35147950e+00 9.53546835e+01
1716.lowfreq: -0.0017 -0.0005 0.0004 1.2898 5.2434 8.1192 22.2510 40.1016 58.0995
frequency: 22.2504 40.0988 58.0921 66.5123 68.0857 83.2551 106.2278 127.4868 151.9921 186.0815 189.8875 200.7964 210.8264 231.9685 234.3678 245.2515 266.4238 304.4313 324.1144 337.7637 390.1891 414.2449 446.7370 455.0005 464.5149 504.1502 516.3689 519.2001 557.4035 590.8231 594.6045 599.6443 685.3823 695.1941 706.4943 729.2775 738.0401 749.1317 765.6468 775.8513 787.3889 797.7049 825.6682 855.1237 880.3814 912.0390 932.8161 945.0522 980.4280 983.0575 1034.0822 1040.2108 1050.9581 1064.4255 1076.6874 1103.5205 1116.8373 1139.9916 1167.3589 1170.5754 1189.7095 1245.5624 1253.8875 1262.5806 1284.6385 1300.1843 1315.1587 1334.9047 1361.9143 1383.1894 1391.5208 1400.7941 1427.2676 1439.9328 1451.7728 1462.8538 1471.7696 1477.2541 1481.0230 1487.0745 1487.3271 1496.3478 1507.5736 1547.2745 1579.9613 1605.5332 1607.4414 1619.3521 2964.0668 2965.6177 2982.1212 2995.9292 3022.7610 3053.5705 3077.9336 3089.3163 3094.7830 3101.9074 3133.9637 3151.9946 3169.5222 3200.6090 3504.3500 3564.5234 3723.0509
redmass: 4.2792 6.3062 3.6810 4.2240 3.6172 3.2211 1.8015 4.3637 4.9162 6.9898 1.8469 1.8874 4.9737 2.9827 3.4476 1.6530 4.5194 4.2212 3.8140 2.9703 5.4135 5.7980 1.2509 2.9776 4.9134 3.8524 1.2566 2.8354 3.7969 6.1516 6.3823 6.7558 5.0151 2.5687 2.1937 5.1840 3.2354 1.2801 3.2074 6.5915 1.8952 3.2820 1.1105 1.3428 4.4691 3.2491 1.3460 2.9258 2.4567 1.2966 2.3940 2.5279 2.9458 1.9537 1.6271 2.3544 2.1248 1.4431 2.4164 1.1691 2.5812 1.4623 2.1902 1.1379 3.3354 1.9828 1.6891 2.8503 1.6762 2.4137 1.1958 1.3212 3.2386 3.8882 3.2178 1.0400 1.0486 1.2393 1.2081 1.8350 1.1516 1.4259 1.5822 3.4565 4.8991 4.6425 2.2334 2.9349 1.0557 1.0693 1.0357 1.0361 1.1077 1.0923 1.0987 1.1005 1.0990 1.1016 1.0857 1.0918 1.0976 1.0943 1.0747 1.0443 1.1059
irintensity: 0.1785 0.0600 0.8653 2.6617 0.6695 1.3152 1.4021 0.3791 0.1662 0.9138 0.6094 0.9735 2.3449 2.0191 3.9017 2.9416 3.4010 2.6853 10.2331 1.5386 5.3400 3.0374 250.7080 45.9656 0.9637 3.3091 10.7994 3.7087 0.7756 11.2769 15.6043 1.2633 7.1994 19.2876 8.7775 5.8026 9.5092 107.4698 10.5091 41.3275 6.1771 24.6575 0.8071 2.6226 59.9564 29.5740 6.4819 10.7654 8.6106 3.0244 55.9071 67.7150 9.7517 25.0089 41.5878 41.9760 24.9434 4.5198 18.8415 12.8222 129.5424 21.5341 77.6003 0.3523 67.3054 9.6851 15.1256 15.7788 30.4153 36.5638 13.0227 28.7207 56.8228 193.4466 167.5934 12.6834 12.8640 88.9607 43.4894 31.5395 10.5760 22.7334 90.7317 1214.3398 182.4252 17.9470 261.9613 347.9109 51.5764 29.8581 32.2473 18.0317 28.8846 0.5376 50.0688 29.9489 29.8803 35.4543 0.8841 27.0098 22.2405 10.4887 88.8843 120.1070 45.2341
temp: 298.150 k
press: 1.00000 atm
elementType: 17 8 7 7 7 7 6 6 6 6 6 6 6 6 6 6 6 6 6 6 1 1 1 1 1 1 1 1 1 1 1 1 1 1 1 1 1
symmnumber: 1
zpe: 770921.1 jmol-1
zpe.correction: 0.293628 hartree
zpe.thermalcorrener: 0.313430 hartree
zpe.thermalcorrenthalpy: 0.314375 hartree
zpe.thermalcorrgfe: 0.244297 hartree
zpe.sumelectzpe: -1296.534074 hartree
zpe.sumelectthermal: -1296.514272 hartree
zpe.sumelectthermalent: -1296.513328 hartree
zpe.sumelectthermalfe: -1296.583406 hartree
dipole: 4.8721 -0.5802 0.1348
dipole: 4.9084
quadrupole: -123.1634 -102.7604 -130.2661
quadrupole: -15.9465 -1.3879 1.3665
quadrupole: -4.4334 15.9696 -11.5361 -15.9465 -1.3879 1.3665
hfenergy: -1296.8277026 hartree
pointgroup: C01 [X(C14H17Cl1N4O1)]
dipole: -1.9185138 0.2089521 0.0692411 debye
polarizability: 298.6592928|11.3669454|247.4600267|-4.4059685|-7.4054988|95.6481814 unknown
InChI: InChI=1S/C14H17ClN4O/c1-3-9-12(15)18-14(16)19-13(9)17-10-7-5-6-8-11(10)20-4-2/h5-8,17H,3-4,16H2,1-2H3
charge 0 multiplicity 1
37 atoms
Cl 4.787077 1.73755 -0.345049
O  -2.454043 1.398875 -0.189084
N  -0.191462 0.120045 -0.151165
N  1.546491 -1.496147 -0.047271
N  3.878322 -0.791643 -0.133973
N  3.300318 -3.050217 0.056463
C  2.107941 0.902562 -0.267174
C  1.158531 -0.18917 -0.152741
C  1.66783 2.350496 -0.366522
C  -1.337233 -0.704755 -0.06496
C  -2.588154 -0.003528 -0.085724
C  3.446756 0.474856 -0.238992
C  1.305054 2.978744 1.00827
C  -1.350635 -2.115623 0.039152
C  -3.811137 -0.693992 -0.005614
C  -2.58252 -2.806718 0.119194
C  -3.806622 -2.107159 0.097663
C  2.891235 -1.741319 -0.044561
C  -3.678228 2.220808 -0.207302
C  -3.237445 3.677419 -0.32325
H  2.484704 2.938903 -0.818756
H  0.809249 2.444604 -1.063711
H  -0.43231 1.112726 -0.223779
H  0.494899 2.424864 1.517187
H  0.976328 4.026682 0.882083
H  2.185592 2.973986 1.674117
H  -0.394521 -2.638731 0.055719
H  -4.761191 -0.152194 -0.021324
H  -2.577398 -3.899029 0.199553
H  -4.757147 -2.647291 0.160758
H  -4.306115 1.918187 -1.069703
H  -4.247425 2.04289 0.727487
H  -4.120892 4.340984 -0.326661
H  -2.593862 3.95918 0.528092
H  -2.674757 3.843539 -1.258001
H  4.295722 -3.254594 0.059621
H  2.606151 -3.788492 0.123957
