program: Gaussian 09
title: 000240881
version: EM64L-G09RevD.01
frameworkgroup: C1[X(C12H11ClN2OS)]
method: RPBEPBE
basis: SDD
operation: Freq
keyword: #p
keyword: freq=noraman
keyword: PBEPBE/SDD
title: #p freq=noraman PBEPBE/SDD
converged: NO YES NO NO
title: Mulliken charges:
elementType: Cl S O N N C C C C C C C C C C C C H H H H H H H H H H H
charge: -0.050245 0.228452 -0.251543 -0.346053 0.023988 0.481923 -0.785385 -0.194119 0.267136 -0.359338 -0.361274 0.107959 -0.397372 -0.206259 -0.205591 -0.766315 -0.100876 0.301516 0.299017 0.245813 0.245777 0.343372 0.252249 0.259214 0.259233 0.247514 0.247363 0.213844
chargesum: 0.00000
title: Mulliken charges with hydrogens summed into heavy atoms:
elementType: Cl S O N N C C C C C C C C C C C C
charge: -0.050245 0.228452 -0.251543 -0.002681 0.023988 0.481923 -0.184852 -0.194119 0.267136 -0.113525 -0.115497 0.107959 -0.145123 0.052956 0.053642 -0.057594 -0.100876
polarizability: 3.25995127e+02 6.41505842e+00 1.26518963e+02 2.89488010e-01 6.01487105e-01 1.14899252e+02
1716.lowfreq: -7.2791 -3.0271 0.0004 0.0016 0.0017 1.9689 10.1510 24.6956 33.8854
frequency: -3.4858 24.6682 33.8833 50.5269 93.0502 97.1754 133.1757 139.7456 161.4392 228.1930 232.9455 273.1902 312.3674 322.1837 349.4222 365.4623 398.6180 401.7116 407.9658 489.6363 494.0457 546.8684 625.9726 629.1525 632.4374 638.5086 641.3442 718.1635 724.9245 731.2044 766.1801 803.1959 830.1124 841.9382 889.0394 901.4860 919.3480 954.1305 967.2609 1001.0937 1004.9421 1047.6462 1071.8931 1073.0562 1093.8351 1125.0270 1130.4771 1185.1454 1218.5994 1226.4764 1249.4134 1262.2103 1297.0907 1354.2708 1378.4072 1396.0436 1402.2885 1413.6689 1446.0060 1450.2878 1465.0480 1478.4140 1505.0150 1568.5053 1586.7092 1600.6941 1638.1426 2985.6048 3059.6992 3064.6079 3097.9652 3136.1958 3138.9417 3140.0811 3141.1676 3173.5748 3176.6361 3488.4849
redmass: 6.7160 4.3528 9.9877 5.8821 7.6946 3.5081 1.1447 9.1374 6.8114 6.5698 4.3847 3.7193 4.3116 7.6071 2.6821 10.8116 2.8570 8.6715 2.8714 5.1886 4.1359 7.2236 6.8319 6.6129 6.8237 6.1093 5.5747 1.7137 4.1363 4.2036 2.9076 3.9917 1.2470 1.7500 1.5288 5.2114 1.3748 1.3580 1.3752 4.1592 1.6507 1.5065 3.0145 4.2615 1.2705 4.2490 1.0971 1.1192 2.2340 3.5236 1.4587 2.2877 1.2678 1.8389 7.4246 2.8597 1.3846 2.2008 1.1176 1.0438 1.0979 2.4955 5.0879 5.1779 7.4208 6.2495 6.6841 1.0365 1.0582 1.0969 1.1004 1.1021 1.0968 1.0902 1.0928 1.0953 1.0963 1.0778
irintensity: 0.3952 0.0272 0.2791 1.0844 0.3031 0.5967 0.1079 0.7874 12.3041 0.3674 0.0045 3.5624 0.6406 1.5274 0.7238 0.8318 11.7598 48.7366 0.0663 5.9505 17.3014 4.1643 0.0241 5.7468 5.8373 40.9454 21.9595 23.6821 15.6078 4.9273 69.2159 33.4515 0.0313 54.8949 1.6245 13.1651 9.0392 0.0904 0.0075 52.1411 28.5834 7.6715 54.8264 4.2697 7.2138 86.3503 3.5181 1.6823 10.1432 158.2177 21.7129 16.4877 0.2020 1.9886 0.2060 6.3489 8.9938 16.5335 8.9539 13.1339 10.4636 100.7355 625.9386 3.0134 1.2919 24.1459 523.8653 22.7167 3.9050 13.1035 15.3575 0.3457 7.8441 9.1373 31.3657 5.0767 0.4666 32.8478
temp: 298.150 k
press: 1.00000 atm
elementType: 17 16 8 7 7 6 6 6 6 6 6 6 6 6 6 6 6 1 1 1 1 1 1 1 1 1 1 1
symmnumber: 1
zpe: 538583.0 jmol-1
zpe.correction: 0.205135 hartree
zpe.thermalcorrener: 0.220533 hartree
zpe.thermalcorrenthalpy: 0.221478 hartree
zpe.thermalcorrgfe: 0.160251 hartree
zpe.sumelectzpe: -1505.524589 hartree
zpe.sumelectthermal: -1505.509191 hartree
zpe.sumelectthermalent: -1505.508247 hartree
zpe.sumelectthermalfe: -1505.569474 hartree
dipole: 0.9212 -2.3588 0.1251
dipole: 2.5354
quadrupole: -137.5819 -116.0545 -106.4464
quadrupole: 13.5174 -0.1507 0.5864
quadrupole: -17.5543 3.9731 13.5812 13.5174 -0.1507 0.5864
hfenergy: -1505.7297245 hartree
pointgroup: C01 [X(C12H11Cl1N2O1S1)]
dipole: 0.376752 -0.8062018 -0.4506879 debye
polarizability: 325.743311|8.9190706|122.9625182|3.4822249|5.549563|118.7075127 unknown
InChI: InChI=1S/C12H11ClN2OS/c1-8-6-14-12(15-11(8)16)17-7-9-2-4-10(13)5-3-9/h2-6,15H,7H2,1H3
charge 0 multiplicity 1
28 atoms
Cl 6.880832 0.495327 0.14654
S  -0.123199 0.812377 0.498482
O  -5.111646 1.535007 0.922317
N  -2.840711 1.043709 0.637779
N  -2.049803 -0.883475 -0.511774
C  2.329429 -0.3425 -0.210136
C  0.854559 -0.623798 -0.331344
C  -1.820826 0.23901 0.158051
C  -4.47864 -0.495091 -0.286932
C  3.063526 -0.803635 0.913331
C  3.011933 0.384786 -1.219617
C  -4.236174 0.745817 0.459105
C  -3.384778 -1.231537 -0.72331
C  4.448268 -0.553776 1.031124
C  4.396238 0.644667 -1.12031
C  -5.910327 -0.894154 -0.531379
C  5.091939 0.168868 0.007986
H  0.49699 -0.662963 -1.370449
H  0.537845 -1.539288 0.189139
H  2.551292 -1.363519 1.704062
H  2.459546 0.751532 -2.092196
H  -2.638432 1.907126 1.155257
H  -3.53045 -2.163229 -1.280803
H  5.012439 -0.913527 1.895978
H  4.920752 1.201599 -1.901601
H  -6.446293 -0.105057 -1.090035
H  -6.451374 -1.015013 0.425026
H  -5.973335 -1.838267 -1.09839
