program: Gaussian 09
title: 000240886
version: EM64L-G09RevD.01
frameworkgroup: C1[X(C12H20Cl2N2O2)]
method: RPBEPBE
basis: SDD
operation: Freq
keyword: #p
keyword: freq=noraman
keyword: PBEPBE/SDD
title: #p freq=noraman PBEPBE/SDD
converged: YES YES NO NO
title: Mulliken charges:
elementType: Cl Cl O O N N C C C C C C C C C C C C H H H H H H H H H H H H H H H H H H H H
charge: -0.090001 -0.090010 -0.291025 -0.291016 -0.122504 -0.122490 -0.440043 -0.358799 -0.358818 -0.440024 0.238534 0.238545 -0.478089 -0.478104 -0.300919 -0.300914 -0.643424 -0.643431 0.287131 0.228093 0.221226 0.262794 0.221237 0.262782 0.287127 0.228088 0.251518 0.236793 0.251530 0.236797 0.306302 0.306305 0.213436 0.249086 0.229882 0.213438 0.249092 0.229875
chargesum: 0.00000
title: Mulliken charges with hydrogens summed into heavy atoms:
elementType: Cl Cl O O N N C C C C C C C C C C C C
charge: -0.090001 -0.090010 -0.291025 -0.291016 -0.122504 -0.122490 0.075181 0.125220 0.125200 0.075191 0.238534 0.238545 0.010222 0.010223 0.005383 0.005391 0.048981 0.048974
polarizability: 2.08131821e+02 1.50722460e-03 1.47115421e+02 8.27504119e+00 2.20325811e-03 1.40206114e+02
1716.lowfreq: -6.6138 -0.0028 -0.0024 -0.0021 2.4745 4.4188 16.7421 24.5255 33.7807
frequency: 16.5833 24.5074 33.7787 43.3657 61.5247 67.3707 94.7247 100.8322 137.8674 149.2295 191.8720 218.8187 230.7814 231.3965 232.9771 260.2295 283.8160 315.6277 320.9709 331.5744 358.1806 376.5797 376.6223 383.1989 420.1323 472.4893 502.4121 523.0211 541.6081 543.8211 585.0935 591.9947 661.1362 662.3510 755.9253 763.7786 863.2341 888.9050 891.6087 908.0917 908.5182 939.1392 950.2738 981.5295 1008.0645 1012.0137 1029.3717 1053.3742 1073.3255 1089.2709 1095.7258 1101.1270 1130.5391 1131.0749 1155.9191 1163.0581 1175.6980 1215.4502 1218.1209 1225.1969 1254.0365 1260.2457 1264.3906 1271.6486 1282.2737 1289.8120 1333.8102 1340.9709 1342.5002 1353.0664 1355.4635 1362.5196 1394.4740 1394.5392 1400.8603 1403.0233 1442.7689 1442.8803 1460.4621 1460.4637 1472.7318 1475.1865 1475.2245 1478.7660 1479.9631 1496.8087 1583.1319 1585.2360 2977.6346 2978.8271 2983.3196 2983.3693 2987.5334 2999.1184 3000.5047 3000.6008 3041.2017 3043.9114 3073.3523 3073.3589 3079.4441 3079.5143 3082.4949 3084.8824 3094.4883 3094.5088 3110.8962 3110.9090
redmass: 7.6980 9.9585 8.8996 4.8298 6.2222 4.0977 6.2113 3.1959 7.8421 5.3851 2.5254 3.1335 1.1656 1.1759 2.9019 5.0708 2.6466 3.2160 2.6571 2.7926 3.1129 3.1505 2.5093 3.7994 3.1699 3.1326 3.2180 3.8148 4.0701 4.0891 2.9057 4.4288 5.1024 2.4119 5.5793 4.7299 1.4815 1.8768 2.0153 1.9276 1.7431 2.0740 2.9282 2.3036 1.8623 1.5799 1.9430 1.8934 1.9475 2.0191 2.3971 2.1529 1.5824 1.8625 2.6585 1.4746 1.5912 2.6085 1.1602 1.4719 1.4730 1.2786 1.2230 1.3803 1.2977 1.4110 1.3235 1.5733 1.4974 1.4790 1.3463 1.3637 1.2306 1.2268 2.9049 3.6668 1.1171 1.1253 1.0474 1.0473 1.0907 1.0489 1.0492 1.0950 1.0948 1.0873 7.3995 7.4233 1.0590 1.0587 1.0384 1.0384 1.0682 1.0681 1.0630 1.0630 1.1035 1.1029 1.0941 1.0941 1.0949 1.0948 1.0962 1.0982 1.0940 1.0940 1.0984 1.0984
irintensity: 0.0014 1.2144 0.2650 2.5039 14.3077 0.1696 8.9025 0.4046 0.9390 0.4929 2.9230 6.0455 0.0597 0.0910 6.1858 0.0339 3.5585 1.4389 1.4309 1.9169 2.8420 12.1968 24.6113 0.6863 14.9980 0.3325 1.5487 7.2358 57.2497 18.7669 1.8414 0.4455 1.7315 0.0132 1.3028 0.1301 1.9403 12.0095 0.7548 0.6657 6.2162 18.8741 0.1435 35.6502 4.9485 10.4515 18.4426 5.1269 0.2767 41.4923 3.2755 12.9213 10.3431 4.0496 30.1314 63.8379 5.4322 1.2027 21.9456 0.3558 23.9293 132.5378 0.4549 12.8287 6.0769 57.5604 3.9110 13.8602 1.4563 32.5403 21.4619 3.2964 44.6595 9.4164 204.7682 71.4049 45.1894 2.6607 9.9314 17.5685 37.3136 20.3299 3.4520 10.2185 7.6203 17.9462 523.7947 9.1796 72.4246 0.1162 34.0719 0.5825 5.2757 59.8396 29.4558 6.2696 25.6980 29.8625 9.7395 15.9123 2.8394 2.4493 9.7091 1.9482 7.3262 18.6702 31.0888 22.3341
temp: 298.150 k
press: 1.00000 atm
elementType: 17 17 8 8 7 7 6 6 6 6 6 6 6 6 6 6 6 6 1 1 1 1 1 1 1 1 1 1 1 1 1 1 1 1 1 1 1 1
symmnumber: 1
zpe: 820111.6 jmol-1
zpe.correction: 0.312364 hartree
zpe.thermalcorrener: 0.332333 hartree
zpe.thermalcorrenthalpy: 0.333277 hartree
zpe.thermalcorrgfe: 0.261034 hartree
zpe.sumelectzpe: -1647.956510 hartree
zpe.sumelectthermal: -1647.936541 hartree
zpe.sumelectthermalent: -1647.935597 hartree
zpe.sumelectthermalfe: -1648.007840 hartree
dipole: 0.0000 -2.4549 -0.0006
dipole: 2.4549
quadrupole: -104.9448 -122.1048 -131.0374
quadrupole: -0.0004 -22.1495 -0.0030
quadrupole: 14.4175 -2.7424 -11.6751 -0.0004 -22.1495 -0.0030
hfenergy: -1648.2688736 hartree
pointgroup: C01 [X(C12H20Cl2N2O2)]
dipole: -0.0002323 -0.9658186 -0.0016654 debye
polarizability: 209.0003562|-0.0152154|147.1154018|2.9539557|0.0129809|139.3375984 unknown
InChI: InChI=1S/C12H20Cl2N2O2/c1-9(13)7-11(17)15-3-5-16(6-4-15)12(18)8-10(2)14/h9-10H,3-8H2,1-2H3
charge 0 multiplicity 1
38 atoms
Cl -2.023667 2.251851 0.469439
Cl 2.024668 2.252365 -0.462139
O  -3.066173 -0.823711 -1.717187
O  3.066375 -0.829629 1.714989
N  -1.424367 -1.371854 -0.156186
N  1.424296 -1.372876 0.152543
C  -0.56512 -1.940402 -1.218381
C  -0.824785 -1.279195 1.206013
C  0.824748 -1.276188 -1.20938
C  0.564819 -1.943997 1.213168
C  -2.637466 -0.804494 -0.517095
C  2.637632 -0.806981 0.514974
C  -3.490131 -0.138162 0.570568
C  3.490346 -0.137778 -0.570895
C  -3.71439 1.350303 0.259184
C  3.715211 1.349676 -0.255188
C  -4.732552 2.037122 1.166228
C  4.733242 2.038845 -1.160599
H  -1.070583 -1.750338 -2.179568
H  -0.473949 -3.036369 -1.092349
H  -1.464916 -1.793211 1.949285
H  -0.725441 -0.217282 1.498219
H  1.464683 -1.788372 -1.954083
H  0.72581 -0.213429 -1.49863
H  1.070373 -1.756807 2.174871
H  0.473173 -3.039571 1.084091
H  -3.090052 -0.250073 1.590881
H  -4.481635 -0.632423 0.536987
H  3.08994 -0.24645 -1.591425
H  4.481669 -0.632508 -0.53903
H  -3.936666 1.486197 -0.810668
H  3.937923 1.482362 0.814976
H  -5.730122 1.580789 1.013785
H  -4.805782 3.112124 0.933505
H  -4.458698 1.929405 2.230237
H  5.730776 1.581912 -1.009728
H  4.806737 3.113177 -0.924882
H  4.459071 1.934168 -2.224832
