program: Gaussian 09
title: 000240876
version: EM64L-G09RevD.01
frameworkgroup: C1[X(C12H10Cl2N2OS)]
method: RPBEPBE
basis: SDD
operation: Freq
keyword: #p
keyword: freq=noraman
keyword: PBEPBE/SDD
title: #p freq=noraman PBEPBE/SDD
converged: YES YES NO NO
title: Mulliken charges:
elementType: Cl Cl S O N N C C C C C C C C C C C C H H H H H H H H H H
charge: -0.042596 -0.037490 0.243129 -0.247198 -0.350041 -0.012763 0.654614 -0.862274 -0.169745 -0.287675 -0.344422 0.270305 0.108931 -0.203624 -0.219117 -0.391493 -0.097417 -0.765234 0.303939 0.321451 0.275546 0.346833 0.283475 0.261292 0.250810 0.248751 0.248355 0.213658
chargesum: 0.00000
title: Mulliken charges with hydrogens summed into heavy atoms:
elementType: Cl Cl S O N N C C C C C C C C C C C C
charge: -0.042596 -0.037490 0.243129 -0.247198 -0.003208 -0.012763 0.654614 -0.236884 -0.169745 -0.287675 -0.068876 0.270305 0.108931 0.079851 0.042175 -0.140684 -0.097417 -0.054470
polarizability: 2.64159155e+02 1.24028397e+01 1.93464520e+02 -1.32616684e+00 1.19599893e+01 1.18564805e+02
1716.lowfreq: -7.6290 -5.6734 0.0006 0.0018 0.0023 3.6792 14.3334 23.4051 32.9709
frequency: 14.2187 23.3309 32.9043 66.9832 97.6357 102.7497 129.8984 147.5109 161.9287 167.6793 189.1586 235.1616 271.5278 294.3924 311.9264 340.1573 368.2553 373.8322 395.3772 401.7567 430.7835 449.4207 494.2764 535.9412 553.6091 613.8793 633.7727 637.3974 638.7464 689.6013 720.5029 728.1593 733.2716 769.0980 818.9568 838.4798 864.7333 881.9665 904.9946 914.6202 968.2916 1002.8291 1027.0310 1047.3043 1070.9405 1081.2484 1122.2546 1134.3891 1184.1159 1219.2220 1228.2601 1247.1290 1265.2674 1270.1509 1356.1208 1367.6220 1380.0885 1401.1295 1416.7774 1438.5632 1449.0838 1460.0843 1463.6711 1508.2215 1567.0583 1571.2265 1592.7421 1640.8086 2985.5221 3049.8542 3065.2828 3097.3128 3133.0659 3140.0693 3153.1118 3178.5997 3185.8540 3486.3420
redmass: 8.8094 9.3027 6.1851 9.2613 3.8426 8.7294 1.1525 6.5411 6.4297 7.1482 15.3095 5.8340 3.7902 3.6677 4.3495 7.1479 10.1255 6.9975 3.8624 3.9867 3.2898 3.7937 6.0985 6.7050 6.4614 4.7328 7.2009 7.0272 7.3640 7.2985 1.8576 5.1864 4.0285 2.6115 3.8698 1.5865 1.4045 1.8178 4.6141 1.3736 1.3533 1.6739 3.9091 1.5048 4.9761 2.5299 3.9794 1.4635 1.0899 2.6664 3.6900 1.2926 1.9053 1.3549 1.8351 3.8336 4.8572 1.2906 2.4132 1.1885 1.0439 2.4572 1.1016 5.0030 7.8199 5.2592 7.3081 6.6774 1.0363 1.0588 1.0969 1.1004 1.1071 1.0930 1.0899 1.0963 1.0938 1.0778
irintensity: 0.1894 0.4240 0.1863 0.4230 1.0598 0.2651 0.1402 1.0175 8.3048 3.0696 1.8295 0.2363 3.4857 2.1500 0.2560 2.5156 7.7393 19.6420 24.8283 2.4597 2.7320 9.6406 1.3548 5.6478 3.6073 45.4078 7.4125 18.8325 4.2352 27.1880 18.1497 6.7322 8.7027 76.9904 52.0462 41.7615 19.5084 10.3861 16.8032 9.4024 2.0684 35.0529 41.9470 7.5905 2.2939 38.2410 51.2097 12.9771 1.3810 13.0426 140.0431 5.8750 47.4283 0.7283 3.5924 5.7250 9.8626 11.2536 16.6849 27.9672 12.5424 82.7557 9.6614 463.7068 36.5785 3.3106 61.1387 530.6237 20.1880 10.1146 12.1640 14.3701 5.8053 26.8883 0.2568 1.3820 0.8143 36.4979
temp: 298.150 k
press: 1.00000 atm
elementType: 17 17 16 8 7 7 6 6 6 6 6 6 6 6 6 6 6 6 1 1 1 1 1 1 1 1 1 1
symmnumber: 1
zpe: 514006.9 jmol-1
zpe.correction: 0.195775 hartree
zpe.thermalcorrener: 0.213182 hartree
zpe.thermalcorrenthalpy: 0.214126 hartree
zpe.thermalcorrgfe: 0.147092 hartree
zpe.sumelectzpe: -1964.914621 hartree
zpe.sumelectthermal: -1964.897214 hartree
zpe.sumelectthermalent: -1964.896270 hartree
zpe.sumelectthermalfe: -1964.963304 hartree
dipole: 0.6221 -0.8407 -2.5647
dipole: 2.7697
quadrupole: -143.5775 -121.5312 -128.0827
quadrupole: 6.3981 10.9458 3.8489
quadrupole: -12.5137 9.5326 2.9811 6.3981 10.9458 3.8489
hfenergy: -1965.1103957 hartree
pointgroup: C01 [X(C12H10Cl2N2O1S1)]
dipole: 0.2646131 0.6771464 0.8117146 debye
polarizability: 264.5106668|-11.1085158|191.5058667|1.6188349|-16.274638|120.1719471 unknown
InChI: InChI=1S/C12H10Cl2N2OS/c1-7-5-15-12(16-11(7)17)18-6-8-2-3-9(13)4-10(8)14/h2-5,16H,6H2,1H3
charge 0 multiplicity 1
28 atoms
Cl 3.385092 -2.723426 0.795084
Cl 5.060143 1.913121 -1.731507
S  -0.392669 -2.080351 0.569623
O  -4.855719 -0.859321 -1.445396
N  -2.77708 -1.242198 -0.438285
N  -1.686277 0.341981 0.955238
C  1.875964 -0.351068 0.795807
C  0.838106 -1.053586 1.62657
C  -1.722464 -0.844768 0.363647
C  3.073228 -0.975851 0.365467
C  1.685751 1.005774 0.417422
C  -3.882077 0.884952 -0.033896
C  -3.930612 -0.422833 -0.700691
C  4.051826 -0.312592 -0.398572
C  2.640284 1.705563 -0.349294
C  -2.775569 1.190506 0.746802
C  3.812322 1.031497 -0.743913
C  -5.045337 1.818507 -0.244739
H  1.264933 -1.803264 2.308641
H  0.19844 -0.340555 2.168778
H  0.759198 1.50033 0.726915
H  -2.778799 -2.162979 -0.893135
H  4.965028 -0.823588 -0.711743
H  2.477935 2.748955 -0.631955
H  -2.707948 2.156637 1.25856
H  -5.988373 1.349512 0.090802
H  -5.177486 2.040746 -1.319599
H  -4.904637 2.767099 0.30057
