program: Gaussian 09
title: 000240891
version: EM64L-G09RevD.01
frameworkgroup: C1[X(C13H16N8O2S)]
method: RPBEPBE
basis: SDD
operation: Freq
keyword: #p
keyword: freq=noraman
keyword: PBEPBE/SDD
title: #p freq=noraman PBEPBE/SDD
converged: YES YES NO NO
title: Mulliken charges:
elementType: S O O N N N N N N N N C C C C C C C C C C C C C H H H H H H H H H H H H H H H H
charge: 0.379371 -0.213490 -0.186743 -0.169241 -0.084170 -0.051946 -0.076967 -0.027034 -0.022144 -0.587406 0.060427 -0.381409 -0.347819 0.163642 -0.338997 0.110535 -0.239680 -0.295476 -0.690907 -0.162095 -0.038009 0.108056 -0.205098 -0.608253 0.242589 0.212056 0.230742 0.205883 0.200811 0.193089 0.268494 0.219296 0.214286 0.217986 0.264135 0.286395 0.251684 0.226371 0.330633 0.340401
chargesum: 0.00000
title: Mulliken charges with hydrogens summed into heavy atoms:
elementType: S O O N N N N N N N N C C C C C C C C C C C C C
charge: 0.379371 -0.213490 -0.186743 -0.169241 -0.084170 -0.051946 -0.076967 -0.027034 -0.022144 0.083628 0.060427 0.073236 0.088806 0.163642 0.054903 0.110535 0.028814 -0.295476 -0.039340 -0.162095 -0.038009 0.108056 0.059037 0.156198
polarizability: 2.54699214e+02 -2.44704770e+01 2.44286760e+02 -7.78414359e+00 2.12537254e+01 1.92912507e+02
1716.lowfreq: -23.5690 -4.6091 -3.8712 -3.2660 -0.0007 -0.0005 0.0011 16.8293 22.3744
frequency: -22.0337 16.8103 22.2379 36.6457 42.6054 54.6177 64.8335 95.2475 102.6061 109.2930 140.2761 148.0962 156.5974 167.9448 200.9773 205.1525 224.6340 232.6989 246.9368 252.4412 277.1612 299.9348 341.2633 360.3411 370.3771 396.4167 398.1671 432.5851 471.7350 481.9027 506.9951 516.8867 546.0813 549.6951 590.5745 623.1966 635.3319 642.6355 649.3982 697.8479 714.5708 724.0751 733.7608 734.1390 760.0818 784.6706 787.4689 796.1061 796.7052 820.4668 868.5328 902.7471 925.6195 954.2381 963.8102 1014.6178 1038.7183 1047.6818 1073.2189 1076.7137 1098.0262 1113.9388 1121.0933 1123.3572 1179.1894 1194.3584 1199.6357 1231.2454 1258.1019 1271.6517 1284.4061 1290.0154 1290.4655 1308.6302 1317.9381 1324.5615 1340.9162 1349.0851 1352.1981 1361.9140 1362.2080 1383.7872 1393.4071 1409.7739 1437.5397 1450.8374 1462.6070 1464.3560 1467.8778 1468.3887 1477.1692 1477.9200 1487.5402 1493.2373 1505.9426 1514.2773 1586.9521 1610.4319 2965.4929 2978.6365 2985.3997 3005.0117 3007.0097 3010.7454 3044.8148 3073.2915 3078.1764 3079.3834 3105.4896 3123.2426 3228.9878 3239.5659 3563.2336 3721.0603
redmass: 2.5479 7.0035 6.5547 6.2194 2.1844 6.7106 7.6384 2.2861 3.0546 6.3412 1.2838 4.7871 4.4760 7.1447 2.9923 3.3038 4.2467 1.3391 5.0514 5.9665 5.1130 5.2852 4.9832 4.9400 4.7222 9.1941 7.5593 3.6353 1.2254 7.0791 7.0407 1.0692 7.8957 5.4600 7.6720 6.5603 5.0150 4.9013 5.0818 7.4896 10.6797 5.1477 2.2780 1.8687 11.0615 4.9294 1.3191 2.4034 2.4631 1.6307 9.0043 1.7414 1.2620 4.8923 7.1373 3.9306 2.4066 1.9593 2.5053 2.2297 4.2097 2.3552 3.6255 1.3493 3.1544 2.1057 1.7962 2.3200 1.5291 1.2945 3.1673 5.2578 1.1736 5.2665 4.3174 2.0786 1.6645 5.9096 2.3774 12.7334 1.6625 7.6624 1.2145 1.7212 2.5616 4.1518 1.2481 1.3233 1.8317 1.0845 1.0850 1.0429 1.0892 1.1255 3.0985 6.5892 9.2817 1.5852 1.0590 1.0364 1.0607 1.0335 1.0646 1.0939 1.1019 1.1028 1.1005 1.1028 1.1016 1.1023 1.0982 1.0991 1.0443 1.1059
irintensity: 0.1327 3.4677 1.5010 1.1210 0.4586 0.8485 0.1449 0.0278 2.1670 0.2834 0.7336 4.0527 1.8392 3.3589 1.0090 0.2359 1.2932 0.1713 4.7917 0.8422 7.8870 0.1559 4.4128 2.5636 0.4400 1.4017 6.9059 0.2679 293.3482 0.4047 9.1778 2.8717 3.2690 1.3444 1.7656 1.7194 17.7525 15.8163 6.0586 1.6913 9.0518 15.6679 3.3426 5.4081 38.0413 19.2169 1.1432 15.0351 7.7226 9.3196 85.6322 5.4267 3.7147 12.6432 17.5270 2.6292 7.7519 3.3020 0.9785 5.3772 19.3244 14.0460 58.2767 3.9973 38.3100 16.3105 32.5765 129.8809 14.8365 0.5651 26.6417 33.1153 4.6649 34.3208 13.5031 44.5347 20.8622 7.5896 32.1754 160.2018 19.7472 51.8514 10.2079 3.9516 62.0860 42.9731 25.9489 35.4110 65.8947 3.8617 5.9011 14.7611 16.4885 41.3377 271.9692 146.1317 266.7733 526.8334 31.0719 29.7581 19.1122 29.4432 46.9907 14.2261 7.9268 8.3989 50.8194 70.5032 4.3903 9.6012 0.2018 0.5904 153.1479 50.0843
temp: 298.150 k
press: 1.00000 atm
elementType: 16 8 8 7 7 7 7 7 7 7 7 6 6 6 6 6 6 6 6 6 6 6 6 6 1 1 1 1 1 1 1 1 1 1 1 1 1 1 1 1
symmnumber: 1
zpe: 786554.5 jmol-1
zpe.correction: 0.299583 hartree
zpe.thermalcorrener: 0.322084 hartree
zpe.thermalcorrenthalpy: 0.323028 hartree
zpe.thermalcorrgfe: 0.245278 hartree
zpe.sumelectzpe: -1489.661433 hartree
zpe.sumelectthermal: -1489.638931 hartree
zpe.sumelectthermalent: -1489.637987 hartree
zpe.sumelectthermalfe: -1489.715738 hartree
dipole: -5.0089 0.8371 -7.7074
dipole: 9.2301
quadrupole: -126.9414 -137.7353 -153.3835
quadrupole: 1.1465 -21.3887 17.7084
quadrupole: 12.4120 1.6181 -14.0301 1.1465 -21.3887 17.7084
hfenergy: -1489.9610154 hartree
pointgroup: C01 [X(C13H16N8O2S1)]
dipole: -2.374255 -0.9554814 -2.576231 debye
polarizability: 243.1049382|-24.1576884|259.1553506|1.1736354|-17.1914037|189.6381926 unknown
InChI: InChI=1S/C13H16N8O2S/c1-3-4-5-20-7-15-8-9(20)17-13(14)18-11(8)24-12-10(21(22)23)16-6-19(12)2/h6-7H,3-5,14H2,1-2H3
charge 0 multiplicity 1
40 atoms
S  2.471657 0.361046 -0.999782
O  1.835624 1.111825 2.015619
O  2.739538 -0.140285 3.706622
N  -2.55266 -0.4868 -0.433616
N  -0.455268 -1.428967 -0.539564
N  -1.960403 1.878845 -0.820958
N  2.622638 -2.349751 -0.259453
N  0.464683 2.182261 -1.122683
N  2.623178 -2.399873 2.013851
N  -1.01893 3.982544 -1.296346
N  2.351164 0.015874 2.488878
C  -4.006692 -0.358619 -0.2210
C  -4.369183 -0.075834 1.254452
C  -1.665721 0.567758 -0.65502
C  -5.894769 0.066507 1.454577
C  -0.363238 -0.032013 -0.707841
C  -1.770057 -1.652811 -0.373046
C  0.699029 0.875316 -0.923725
C  -6.270145 0.345477 2.925785
C  2.474798 -1.022768 0.155745
C  -0.843801 2.6379 -1.075941
C  2.489851 -1.093228 1.564882
C  2.693766 -3.134517 0.888374
C  2.510957 -2.839174 -1.640367
H  -4.360747 0.468822 -0.86203
H  -4.489285 -1.291367 -0.567889
H  -3.860772 0.852587 1.577288
H  -3.9824 -0.894369 1.89335
H  -6.273673 0.888204 0.81345
H  -6.402266 -0.858806 1.111945
H  -2.217152 -2.631643 -0.211264
H  -7.363388 0.449164 3.048907
H  -5.931611 -0.47528 3.585241
H  -5.798771 1.279153 3.284567
H  2.791684 -4.216805 0.853551
H  1.46288 -2.734948 -1.969844
H  3.166872 -2.260681 -2.309586
H  2.809936 -3.899121 -1.666717
H  -1.952191 4.38027 -1.241422
H  -0.199035 4.568008 -1.42989
