program: Gaussian 09
title: 000240835
version: EM64L-G09RevD.01
frameworkgroup: C1[X(C9H14N2O2)]
method: RPBEPBE
basis: SDD
operation: Freq
keyword: #p
keyword: freq=noraman
keyword: PBEPBE/SDD
title: #p freq=noraman PBEPBE/SDD
converged: YES YES NO NO
title: Mulliken charges:
elementType: O O N N C C C C C C C C C H H H H H H H H H H H H H H
charge: -0.264823 -0.264986 -0.618859 -0.619180 0.572740 -0.629048 -0.626193 -0.628135 -0.626451 -0.207175 -0.206956 0.206927 0.207516 0.261302 0.231282 0.243776 0.244491 0.260441 0.231303 0.243909 0.245402 0.230035 0.228960 0.329876 0.312024 0.329855 0.311964
chargesum: 0.00000
title: Mulliken charges with hydrogens summed into heavy atoms:
elementType: O O N N C C C C C C C C C
charge: -0.264823 -0.264986 0.023042 0.022639 0.572740 -0.136464 -0.137925 -0.136391 -0.137140 0.022860 0.022005 0.206927 0.207516
polarizability: 1.48504934e+02 7.62074006e+00 1.01768576e+02 -1.06053156e-01 1.10812615e-02 8.77426588e+01
1716.lowfreq: -5.6137 -4.8203 -0.0010 -0.0008 0.0004 18.6922 23.4575 33.0729 36.7420
frequency: 23.2827 32.1944 36.1895 38.3423 158.6555 175.1837 198.7703 250.6482 260.8153 301.6583 381.6859 393.6487 395.2304 503.7866 504.5219 514.6062 581.3893 582.6046 586.6713 590.4763 641.3225 705.9024 713.7096 724.1990 812.6529 830.2068 852.2093 857.6762 898.4303 899.9897 954.4641 983.5028 991.3003 1015.7939 1039.6917 1045.0419 1046.6569 1069.9375 1120.2516 1121.4918 1163.4717 1206.3699 1207.7615 1218.6772 1224.6512 1232.6233 1236.4791 1240.3284 1264.7605 1271.8272 1291.1340 1379.6044 1383.7043 1440.3306 1441.3568 1452.8745 1461.0654 1592.9033 1593.6743 1637.7178 1638.0614 3003.2954 3004.0737 3009.9141 3011.4172 3016.6915 3017.2937 3079.6237 3084.2286 3088.0686 3089.1177 3514.9391 3514.9964 3672.0746 3672.1004
redmass: 4.8678 4.4651 4.8765 4.2928 4.9547 4.0810 5.3109 3.6866 1.9934 3.0563 2.0295 2.7920 2.4469 1.1472 1.1528 2.8511 2.5856 2.7682 1.3309 1.3582 2.7724 2.7682 3.3104 4.0099 1.4570 3.0297 2.6995 1.4958 2.3322 2.3312 2.5109 4.0420 2.0457 2.3674 1.4542 1.8170 1.9511 1.1647 1.9483 2.3112 1.9561 1.2408 1.1837 1.4713 1.6361 1.3871 1.5917 1.6697 1.6684 1.5916 3.1452 2.8016 2.7411 1.0837 1.0827 1.1357 1.1180 1.5053 1.5202 3.0972 3.1359 1.0574 1.0583 1.0603 1.0617 1.0859 1.0840 1.1075 1.1072 1.1075 1.1070 1.0446 1.0446 1.1042 1.1042
irintensity: 16.8205 8.1485 3.2954 3.1133 1.5601 2.3379 0.0236 26.1907 0.0359 2.1255 0.9681 4.1513 2.5176 105.0060 224.4350 5.9067 23.7832 17.9846 54.2807 121.0346 12.3561 1.3408 11.8162 31.3799 2.7727 1.4557 0.0689 5.9092 0.3030 1.0458 2.3417 0.4505 0.5781 1.0746 3.9205 2.4101 1.1744 0.9666 9.8409 3.4052 8.3344 1.6885 2.3324 0.0275 2.2309 0.1002 19.4661 0.4627 204.9291 5.9471 2.4522 1.6021 277.3824 10.2383 15.3121 15.0546 1.6444 144.8074 4.3580 106.1719 390.4335 43.6359 44.1469 3.6841 23.6356 27.5655 18.6280 2.5550 29.2852 16.0929 38.7079 57.4649 1.5777 22.1544 17.7106
temp: 298.150 k
press: 1.00000 atm
elementType: 8 8 7 7 6 6 6 6 6 6 6 6 6 1 1 1 1 1 1 1 1 1 1 1 1 1 1
symmnumber: 1
zpe: 587318.6 jmol-1
zpe.correction: 0.223698 hartree
zpe.thermalcorrener: 0.236851 hartree
zpe.thermalcorrenthalpy: 0.237795 hartree
zpe.thermalcorrgfe: 0.181649 hartree
zpe.sumelectzpe: -610.297535 hartree
zpe.sumelectthermal: -610.284381 hartree
zpe.sumelectthermalent: -610.283437 hartree
zpe.sumelectthermalfe: -610.339583 hartree
dipole: -0.0219 0.0041 3.7743
dipole: 3.7744
quadrupole: -63.0499 -79.3029 -78.7131
quadrupole: 28.2665 -0.0168 0.0048
quadrupole: 10.6387 -5.6143 -5.0244 28.2665 -0.0168 0.0048
hfenergy: -610.5212325 hartree
pointgroup: C01 [X(C9H14N2O2)]
dipole: 0.0169141 -0.1075736 1.4809587 debye
polarizability: 148.4696838|7.7226418|101.7391697|0.3181649|0.9475429|87.8073161 unknown
InChI: InChI=1S/C9H14N2O2/c10-7(12)5-1-9(2-5)3-6(4-9)8(11)13/h5-6H,1-4,10-11H2
charge 0 multiplicity 1
27 atoms
O  -3.661478 1.226058 -0.583428
O  3.645108 -1.120715 -0.788801
N  -4.579276 -0.707434 0.308844
N  4.586597 0.660753 0.359005
C  -0.000722 0.002405 0.05483
C  -1.104703 0.70392 0.916241
C  -1.132436 -0.752918 -0.707386
C  1.113572 -0.786396 0.822881
C  1.121136 0.835255 -0.636242
C  -2.135506 -0.385037 0.457509
C  2.139212 0.347424 0.468785
C  -3.505139 0.124035 0.024684
C  3.502495 -0.111111 -0.034471
H  -1.394567 1.684117 0.496959
H  -0.925836 0.797477 2.001343
H  -0.9749 -1.825097 -0.913195
H  -1.413274 -0.232653 -1.640704
H  1.396794 -1.716667 0.2984
H  0.948252 -0.993919 1.894219
H  0.960762 1.92302 -0.724533
H  1.390603 0.417281 -1.622673
H  -2.219431 -1.211622 1.186646
H  2.232857 1.0898 1.282476
H  -5.51099 -0.424275 0.005082
H  -4.461708 -1.594135 0.795299
H  5.514881 0.410569 0.018026
H  4.479699 1.474164 0.962004
