program: Gaussian 09
title: 000020465
version: EM64L-G09RevD.01
frameworkgroup: C1[X(C5H9NO2)]
method: RPBEPBE
basis: SDD
operation: Freq
keyword: #pfreq=noraman
keyword: PBEPBE/SDD
title: #p freq=noraman PBEPBE/SDD
converged: NO YES NO NO
title: Mulliken charges:
elementType: O O N C C C C C H H H H H H H H H
charge: -0.283077 -0.254205 -0.624261 0.383450 -0.258898 -0.734638 -0.726884 0.255391 0.192704 0.295844 0.217575 0.203465 0.215957 0.231995 0.231475 0.338845 0.315261
chargesum: 0.00000
title: Mulliken charges with hydrogens summed into heavy atoms:
elementType: O O N C C C C C
charge: -0.283077 -0.254205 0.029845 0.383450 -0.066194 -0.017754 -0.047456 0.255391
polarizability: 8.21903924e+01 5.52960378e+00 6.75022423e+01 1.18561161e+00 2.35321105e+00 5.04935982e+01
1716.lowfreq: -18.3757 -13.4354 -6.0726 -0.0009 -0.0009 0.0003 54.1703 138.5393 155.0667
frequency: 54.1500 138.5300 155.0583 185.9106 213.5027 304.2715 337.1129 365.1293 417.0209 432.5609 489.7870 577.7702 604.4483 646.8646 705.9500 771.8023 849.1295 902.9196 943.3657 992.7068 1023.5707 1049.6963 1083.0042 1115.3545 1241.1182 1286.7172 1327.9785 1387.6429 1398.3211 1406.3596 1452.7037 1461.3258 1478.5379 1484.0183 1594.3448 1645.4539 2982.7563 2986.8881 3046.5379 3070.9475 3078.6935 3093.0601 3116.5125 3518.1053 3672.6259
redmass: 4.3210 1.3268 1.9157 2.0584 1.4540 5.5846 2.5875 2.7698 3.5799 2.5732 1.1688 1.3752 4.1956 3.6954 5.1570 4.1177 4.2851 3.0947 1.3969 1.3260 1.3824 2.0751 1.6826 1.7775 1.9798 2.6127 2.6212 1.2892 1.2525 2.4330 1.0525 1.0601 1.1474 1.0518 1.4606 3.3572 1.0364 1.0369 1.0884 1.0983 1.0983 1.1000 1.0994 1.0447 1.1043
irintensity: 9.2496 0.8362 0.1011 5.4272 2.1603 1.5361 0.1688 4.7058 8.5121 2.0780 144.4764 126.5830 17.1265 10.5310 58.5617 4.6506 9.8372 0.4136 1.9764 0.8893 8.7013 3.4917 6.4769 26.4282 57.9159 81.7767 12.0544 41.3598 28.6441 113.1930 7.4117 6.0693 2.3315 31.5271 70.7227 251.1799 10.6028 42.1428 36.6017 7.1027 39.0228 26.8064 0.4114 40.3571 27.0085
temp: 298.150 k
press: 1.00000 atm
elementType: 8 8 7 6 6 6 6 6 1 1 1 1 1 1 1 1 1
symmnumber: 1
zpe: 359419.6 jmol-1
zpe.correction: 0.136896 hartree
zpe.thermalcorrener: 0.145982 hartree
zpe.thermalcorrenthalpy: 0.146926 hartree
zpe.thermalcorrgfe: 0.103270 hartree
zpe.sumelectzpe: -400.469172 hartree
zpe.sumelectthermal: -400.460086 hartree
zpe.sumelectthermalent: -400.459141 hartree
zpe.sumelectthermalfe: -400.502797 hartree
dipole: -0.1394 -3.7104 -3.3905
dipole: 5.0282
quadrupole: -39.2722 -46.5410 -52.3864
quadrupole: 8.0618 1.2294 0.6687
quadrupole: 6.7943 -0.4745 -6.3199 8.0618 1.2294 0.6687
hfenergy: -400.6060674 hartree
pointgroup: C01 [X(C5H9N1O2)]
dipole: -0.1846368 -1.6152463 -1.1270645 debye
dipolederiv: -0.3974099 -0.0582432 -0.0037534 0.0062573 -0.6194952 0.101871 -0.054715 0.0969118 -0.4004763 -0.6773845 -0.0250163 -0.1598231 0.075145 -0.4697149 -0.1970232 -0.0166991 -0.2671431 -0.8669323 -0.8106881 0.2165037 0.4862509 0.2296106 -0.8493525 -0.1753666 0.3148483 -0.0601348 -0.5576604 0.6128328 0.0653006 0.0137362 0.0661491 0.3568446 -0.0835713 -0.1222194 0.0073334 0.453433 -0.3521987 0.0915259 -0.0027533 -0.049218 0.1853194 0.0580045 0.0346722 0.0084203 0.1942138 -0.1264446 -0.0434674 -0.0344637 -0.0492718 0.0395473 -0.03215 -0.0529355 0.0088755 -0.2070447 -0.1194576 -0.0560344 -0.0941913 0.0002685 0.0287641 -0.0045489 -0.0331647 -0.0403894 -0.0603858 1.2505864 -0.3721645 -0.1837862 -0.4640578 0.6169525 0.5140528 -0.0187028 0.4671727 1.0332945 0.0056209 0.0396596 -0.0022869 0.0563938 0.0298888 -0.085601 -0.0177924 -0.0986075 -0.1474458 0.1006294 -0.0477779 -0.1156518 -0.0323985 0.1050437 -0.0174397 -0.0723601 0.0017275 0.0893243 -0.0679877 0.1130618 0.0983374 0.1100933 0.0362875 -0.0423454 0.0672072 -0.0043472 0.0478966 0.1002717 -0.0399848 0.0257639 -0.0569359 -0.1251624 0.080079 0.0377129 0.0312204 0.0459144 0.0513015 -0.033232 -0.0001781 -0.0845788 -0.1242768 0.0352716 -0.0064466 0.0577892 0.0876492 -0.0928657 0.0677749 0.0382224 0.1059302 0.0311651 -0.0418568 0.0571488 -0.0637012 0.071859 0.0833174 -0.0184509 0.0537106 -0.0098123 0.1002212 0.0259669 -0.0123789 0.0116914 -0.1415942 0.2079536 0.0540567 -0.0508137 0.0615609 0.3285937 -0.0678932 -0.0330558 -0.0792845 0.1969118 0.231923 0.0464881 -0.0683198 0.0348644 0.329374 -0.0674497 -0.0711189 -0.0775345 0.1610428 unknown
polarizability: 80.841281|-5.8354982|53.3839681|-4.82988|6.5453288|65.9609838 unknown
InChI: InChI=1S/C5H9NO2/c1-5(2)3(8-5)4(6)7/h3H,6H2,1-2H3
charge 0 multiplicity 1
17 atoms
O  -0.599638 1.189062 -0.418573
O  1.721205 0.104501 1.190422
N  2.282575 -1.135381 -0.689441
C  -1.252308 -0.069427 0.131614
C  0.064631 -0.143605 -0.619673
C  -1.307286 -0.157524 1.645869
C  -2.510601 -0.484089 -0.618658
C  1.406526 -0.355572 0.055338
H  0.011767 -0.499433 -1.661408
H  -0.368221 0.203246 2.092437
H  -2.149034 0.450942 2.02345
H  -1.473399 -1.204407 1.96278
H  -2.743579 -1.548577 -0.429836
H  -3.371805 0.118982 -0.278511
H  -2.397188 -0.333247 -1.705984
H  3.201358 -1.336983 -0.295271
H  2.059998 -1.471288 -1.624855
