program: Gaussian 09
title: 000240824
version: EM64L-G09RevD.01
frameworkgroup: C1[X(C10H9F3N2O3S)]
method: RPBEPBE
basis: SDD
operation: Freq
keyword: #p
keyword: freq=noraman
keyword: PBEPBE/SDD
title: #p freq=noraman PBEPBE/SDD
converged: YES YES NO NO
title: Mulliken charges:
elementType: S F F F O O O N N C C C C C C C C C C H H H H H H H H H
charge: 0.899488 -0.131644 -0.133053 -0.180517 -0.526276 -0.525765 -0.191313 -0.275397 -0.455643 -0.408826 -0.400406 -0.035017 -0.214545 -0.243125 -0.423533 -0.309196 0.531486 0.143861 0.305749 0.257633 0.289536 0.280973 0.258390 0.288113 0.287462 0.242060 0.314306 0.355194
chargesum: 0.00000
title: Mulliken charges with hydrogens summed into heavy atoms:
elementType: S F F F O O O N N C C C C C C C C C C
charge: 0.899488 -0.131644 -0.133053 -0.180517 -0.526276 -0.525765 -0.191313 -0.275397 -0.100449 0.138343 0.138958 -0.035017 0.073569 0.044338 -0.181473 0.005111 0.531486 0.143861 0.305749
polarizability: 2.57470645e+02 -6.52558321e+00 1.51162083e+02 -9.41612106e+00 4.50871613e+00 1.06674357e+02
1716.lowfreq: -9.6255 -3.8762 -1.9449 -0.0024 -0.0022 0.0008 17.8990 22.0249 26.1774
frequency: 17.2709 21.8430 26.1174 33.3727 59.2919 75.6316 82.4144 138.2406 150.1664 167.5816 181.5513 216.4178 246.1894 253.5739 291.6569 295.8882 321.9688 340.4027 351.0709 379.4839 405.3488 412.5882 433.0787 446.6063 479.3006 507.0948 536.2865 606.9512 621.0392 659.9395 697.9667 716.4443 733.1182 743.5137 747.1063 798.5619 811.4210 824.0928 840.3921 851.0062 870.1595 930.8444 963.0566 967.0941 991.8001 998.2673 1010.9452 1044.0053 1058.5654 1071.4838 1083.5923 1091.2467 1093.6419 1126.4214 1159.0503 1189.5006 1206.0466 1211.4744 1264.8297 1302.4374 1386.0932 1405.1757 1455.0255 1465.7251 1478.0410 1528.6980 1600.3080 1605.9112 1650.0366 3076.5295 3086.8365 3133.1148 3161.7705 3169.4331 3183.8702 3199.3294 3201.4490 3501.4703
redmass: 8.6757 4.1099 7.3314 6.0332 5.2998 11.1710 6.4302 9.3722 8.8438 7.9688 4.8197 6.2022 9.2043 11.0222 11.4375 6.3584 6.2882 6.3465 5.6481 8.6341 6.7426 2.9689 9.2226 8.9167 11.5503 12.2987 3.0515 9.7622 7.6296 10.5133 3.6100 1.8821 2.3559 2.0023 8.3419 8.6780 9.7780 1.6983 1.3778 7.2088 1.4490 16.9376 1.0814 1.3744 5.1821 1.3489 11.0925 12.4986 2.6343 1.2618 5.8486 1.3470 1.3026 1.3386 1.3761 1.1293 3.3313 5.0601 2.1172 1.3634 5.8290 3.9214 1.0738 1.1547 2.3763 2.0444 5.9787 4.9244 8.8652 1.0526 1.0592 1.0905 1.0916 1.0957 1.1167 1.0953 1.1159 1.0766
irintensity: 1.3637 1.0278 1.2151 1.0948 0.1171 5.0935 6.2556 0.4361 0.9428 2.6711 0.3240 27.5600 8.8934 3.2991 2.7586 24.3949 3.4427 7.0894 1.3293 2.3380 1.5017 0.1410 0.8372 14.2376 48.5756 45.4802 73.8108 73.3500 16.2773 4.0411 1.6938 43.0850 14.3645 25.6775 0.3637 70.6552 37.1860 52.2357 30.5453 47.2143 52.8637 73.6878 1.4942 1.3146 3.8092 0.4636 166.3583 255.9853 14.9366 29.7180 240.7976 3.5304 10.7374 12.4417 0.5022 12.4740 14.3527 107.8956 15.9347 3.1717 56.7679 28.7616 14.9060 4.6659 43.3483 269.1013 50.9951 24.9818 292.2681 4.8142 11.8977 8.6243 2.9988 6.0473 3.3427 5.2949 1.9811 59.2410
temp: 298.150 k
press: 1.00000 atm
elementType: 16 9 9 9 8 8 8 7 7 6 6 6 6 6 6 6 6 6 6 1 1 1 1 1 1 1 1 1
symmnumber: 1
zpe: 481169.6 jmol-1
zpe.correction: 0.183268 hartree
zpe.thermalcorrener: 0.202094 hartree
zpe.thermalcorrenthalpy: 0.203038 hartree
zpe.thermalcorrgfe: 0.132339 hartree
zpe.sumelectzpe: -1417.611749 hartree
zpe.sumelectthermal: -1417.592922 hartree
zpe.sumelectthermalent: -1417.591978 hartree
zpe.sumelectthermalfe: -1417.662677 hartree
dipole: -0.8121 2.1848 3.3631
dipole: 4.0919
quadrupole: -129.7730 -115.6012 -121.9274
quadrupole: 13.1758 -16.6358 0.2394
quadrupole: -7.3391 6.8327 0.5065 13.1758 -16.6358 0.2394
hfenergy: -1417.7950164 hartree
pointgroup: C01 [X(C10H9F3N2O3S1)]
dipole: 0.3823766 0.5641621 -1.4584829 debye
polarizability: 258.0001769|-1.8411489|147.5857648|-8.4000856|-12.0705423|109.7211433 unknown
InChI: InChI=1S/C10H9F3N2O3S/c11-10(12,13)9(16)14-7-1-3-8(4-2-7)19(17,18)15-5-6-15/h1-4,14H,5-6H2
charge 0 multiplicity 1
28 atoms
S  3.539672 -0.033991 0.658994
F  -5.529075 -0.554468 -1.217864
F  -5.692833 0.321979 0.864325
F  -4.802576 1.56437 -0.820421
O  4.164017 1.462683 0.838521
O  3.813357 -1.199068 1.771715
O  -3.384282 -1.500244 0.541056
N  4.080624 -0.706129 -1.117877
N  -2.448719 0.560272 -0.164983
C  5.164491 -1.779998 -0.948007
C  5.563938 -0.380923 -1.35394
C  1.690013 0.119822 0.39905
C  1.193992 1.330808 -0.110468
C  0.871686 -0.965046 0.746369
C  -0.196485 1.447991 -0.286052
C  -0.522191 -0.845643 0.569604
C  -1.054342 0.363554 0.045589
C  -3.470522 -0.33389 0.082383
C  -4.875213 0.242865 -0.271089
H  5.089128 -2.579429 -1.691065
H  5.376488 -2.107047 0.078298
H  6.060503 0.260463 -0.615739
H  5.78281 -0.141677 -2.398866
H  1.872141 2.157877 -0.340856
H  1.309337 -1.876469 1.165668
H  -0.613928 2.38245 -0.679761
H  -1.188611 -1.668971 0.831223
H  -2.72542 1.470958 -0.546604
