program: Gaussian 09
title: 000240810
version: EM64L-G09RevD.01
frameworkgroup: C1[X(C13H16N4O)]
method: RPBEPBE
basis: SDD
operation: Freq
keyword: #p
keyword: freq=noraman
keyword: PBEPBE/SDD
title: #p freq=noraman PBEPBE/SDD
converged: YES YES NO NO
title: Mulliken charges:
elementType: O N N N N C C C C C C C C C C C C C H H H H H H H H H H H H H H H H
charge: -0.452710 -0.463695 -0.133908 -0.111248 -0.589965 0.487432 -0.548911 0.430470 -0.396742 -0.413984 -0.466804 -0.332304 -0.324743 0.291355 -0.500032 0.277321 -0.044067 -0.778577 0.226834 0.224744 0.233526 0.229655 0.214224 0.307293 0.303046 0.201605 0.203361 0.221755 0.228856 0.253186 0.228566 0.341940 0.329641 0.322881
chargesum: 0.00000
title: Mulliken charges with hydrogens summed into heavy atoms:
elementType: O N N N N C C C C C C C C C C C C C
charge: -0.110769 -0.160649 -0.133908 -0.111248 0.062557 0.487432 -0.097333 0.430470 -0.163216 -0.184329 -0.252580 -0.025010 0.080222 0.291355 -0.278277 0.277321 -0.044067 -0.067969
polarizability: 3.08654048e+02 -1.71105620e+00 1.83706676e+02 -8.49684707e+00 -4.75144167e+00 8.91215736e+01
1716.lowfreq: -73.0671 -10.8029 -3.3333 -0.0007 -0.0004 -0.0001 1.6809 21.3513 28.5985
frequency: -73.0634 21.1205 28.5870 44.1951 75.4768 80.3525 98.0080 159.0003 189.4523 207.7968 216.9370 232.7702 242.4535 254.5763 297.2851 343.8337 360.6516 388.8440 410.7728 448.8755 453.5105 521.4562 528.7844 533.3665 569.9827 575.5275 603.8092 615.2372 633.1123 674.9031 714.1715 728.8398 773.9873 783.2666 815.1195 822.7150 825.8105 834.3907 862.0441 920.3208 928.8021 942.9739 976.1006 989.2750 994.0842 1002.0751 1009.5825 1026.0027 1046.9604 1063.4757 1098.0812 1126.0932 1170.1248 1184.5236 1190.3588 1207.1843 1218.3641 1259.9025 1274.4518 1276.4615 1307.4330 1309.8592 1345.8510 1385.4606 1394.8428 1402.6805 1412.8524 1417.3982 1462.1456 1469.7844 1472.4439 1481.7005 1486.8233 1496.2021 1513.9744 1559.2495 1564.5177 1598.3865 1611.6941 1628.6928 2939.8180 2986.7658 2991.4269 3004.0995 3066.7394 3066.9306 3099.8715 3118.0166 3118.8685 3132.0116 3145.3009 3194.1087 3537.1729 3562.8793 3570.5943 3722.7756
redmass: 1.0312 3.3655 5.0216 3.9884 3.3064 3.9238 4.3607 4.3398 4.8858 4.3160 4.9782 4.4726 4.2242 1.0852 3.0996 3.6441 3.3108 4.6891 2.9886 1.2137 2.9755 2.3300 1.2521 4.2011 4.3303 2.4281 5.1276 1.5053 6.7494 4.2228 5.7570 3.6602 4.5085 3.8979 1.1545 1.7461 1.7170 3.1340 1.5013 8.5457 2.2579 1.4012 5.6853 1.4058 2.0224 2.4116 2.7033 1.4980 1.5834 2.7923 2.3487 1.4416 1.1515 1.4234 1.1725 1.2501 2.2125 2.4031 2.3855 1.6402 1.5078 1.6782 2.3562 1.4601 3.4154 1.3898 3.0957 3.1794 1.3303 1.0466 1.0873 2.8705 1.0860 2.4896 3.3817 5.6133 3.7522 2.2845 1.9847 6.3789 1.0546 1.0379 1.1073 1.0594 1.1043 1.0974 1.0877 1.0984 1.0908 1.0958 1.0928 1.0940 1.0753 1.0441 1.0664 1.1058
irintensity: 0.3998 1.5074 0.2203 0.1284 5.5433 3.5983 2.6468 1.6357 10.1525 2.5725 0.1297 3.4180 7.3801 152.4466 1.5361 26.4545 4.7831 2.2936 0.2685 282.5768 0.5223 40.6515 0.5245 9.5086 7.5044 0.2492 5.4378 52.1528 0.5689 2.1597 3.0443 0.0534 2.5774 12.0078 0.7027 18.5791 82.5107 6.7130 39.9506 10.1441 11.3856 1.6537 113.1297 14.5713 1.5690 26.0854 8.2264 0.4010 9.0537 7.7472 2.1836 8.8269 0.1413 6.9024 7.2707 19.6334 0.8500 49.8119 17.0728 12.8984 5.5193 5.0184 6.5950 53.3200 46.7422 5.4739 86.2114 19.8172 140.6468 16.8629 6.1991 76.4875 6.5637 144.1037 432.4465 1015.3249 86.9128 142.2507 346.2142 40.8648 58.1874 20.5582 39.3498 36.2852 26.7623 19.1241 22.6740 11.4648 22.7679 20.0221 7.9559 11.1135 18.7638 93.5246 2.3498 43.0336
temp: 298.150 k
press: 1.00000 atm
elementType: 8 7 7 7 7 6 6 6 6 6 6 6 6 6 6 6 6 6 1 1 1 1 1 1 1 1 1 1 1 1 1 1 1 1
symmnumber: 1
zpe: 720484.5 jmol-1
zpe.correction: 0.274418 hartree
zpe.thermalcorrener: 0.291218 hartree
zpe.thermalcorrenthalpy: 0.292162 hartree
zpe.thermalcorrgfe: 0.228142 hartree
zpe.sumelectzpe: -797.919534 hartree
zpe.sumelectthermal: -797.902734 hartree
zpe.sumelectthermalent: -797.901790 hartree
zpe.sumelectthermalfe: -797.965810 hartree
dipole: -0.6203 -1.0983 1.7852
dipole: 2.1859
quadrupole: -112.0380 -85.1312 -108.8142
quadrupole: 2.3124 11.2949 -0.2710
quadrupole: -10.0435 16.8632 -6.8197 2.3124 11.2949 -0.2710
hfenergy: -798.1939516 hartree
pointgroup: C01 [X(C13H16N4O1)]
dipole: 0.2350368 0.5148085 0.6475495 debye
polarizability: 308.5340481|0.5314358|183.4900714|10.120615|-6.4602822|89.4581786 unknown
InChI: InChI=1S/C13H16N4O/c1-9-8-12(17-13(14)15-9)16-11-4-2-10(3-5-11)6-7-18/h2-5,8,16,18H,6-7,14H2,1H3
charge 0 multiplicity 1
34 atoms
O  -6.878022 -0.728721 0.643272
N  0.76996 1.222282 -0.152776
N  1.958616 -0.840686 0.06117
N  4.408498 -0.822995 0.275854
N  3.189835 -2.817125 0.274703
C  -3.350693 0.088786 -0.471794
C  -4.82371 -0.281449 -0.547072
C  -0.576244 0.78222 -0.250192
C  -2.93324 1.444427 -0.492099
C  -2.346993 -0.903393 -0.338547
C  -1.573108 1.789917 -0.384411
C  -0.978342 -0.580563 -0.228477
C  -5.463494 -0.372681 0.850295
C  1.966901 0.523066 -0.012702
C  3.187177 1.266252 0.052892
C  4.391262 0.547042 0.198488
C  3.184301 -1.442583 0.201869
C  5.729903 1.248443 0.278653
H  -4.960205 -1.25758 -1.0480
H  -5.389995 0.467051 -1.131618
H  -3.681752 2.238784 -0.601891
H  -2.640482 -1.960947 -0.329248
H  -1.278432 2.847988 -0.409125
H  -0.213101 -1.350739 -0.130171
H  0.884611 2.236957 -0.194166
H  -5.369776 0.603647 1.372567
H  -4.941417 -1.144855 1.454956
H  3.19292 2.359043 -0.007935
H  5.771246 1.930413 1.148094
H  6.531478 0.500485 0.376843
H  5.917379 1.855431 -0.626288
H  -7.331903 -0.804389 1.519773
H  4.079535 -3.296446 0.380273
H  2.312183 -3.326278 0.227712
