program: Gaussian 09
title: 000240811
version: EM64L-G09RevD.01
frameworkgroup: C1[X(C12H12BrClN4)]
method: RPBEPBE
basis: SDD
operation: Freq
keyword: #p
keyword: freq=noraman
keyword: PBEPBE/SDD
title: #p freq=noraman PBEPBE/SDD
converged: YES YES NO NO
title: Mulliken charges:
elementType: Br Cl N N N N C C C C C C C C C C C C H H H H H H H H H H H H
charge: -0.007637 -0.044115 -0.447325 -0.146096 -0.000487 -0.586495 0.362135 -0.514937 0.150028 0.583374 -0.667407 -0.336259 -0.485134 -0.307079 -0.021600 -0.187073 -0.224993 -0.255774 0.245459 0.206224 0.303927 0.219498 0.225223 0.238384 0.320312 0.248166 0.227859 0.236567 0.338285 0.326970
chargesum: 0.00000
title: Mulliken charges with hydrogens summed into heavy atoms:
elementType: Br Cl N N N N C C C C C C C C C C C C
charge: -0.007637 -0.044115 -0.143398 -0.146096 -0.000487 0.078761 0.362135 -0.063254 0.150028 0.583374 0.015698 -0.336259 -0.485134 0.013233 -0.021600 0.061093 0.002866 -0.019207
polarizability: 2.82336472e+02 1.36732133e+01 2.38889085e+02 2.46735526e+00 5.18269164e+00 7.96437079e+01
1716.lowfreq: -2.8783 0.0011 0.0020 0.0021 2.9058 5.5854 19.7126 40.2649 57.7875
frequency: 19.5406 40.2607 57.7817 71.4759 79.8694 126.8702 142.4310 166.8033 188.0338 197.3165 207.7411 217.6914 257.0338 278.4858 306.0479 327.2233 352.8840 405.9846 419.0186 439.3058 456.9403 508.5818 516.5919 519.2965 533.9647 591.1262 596.7273 649.3294 657.8079 688.5175 702.5362 725.8359 734.3995 758.0541 776.4761 784.8068 797.0210 873.8553 882.5895 945.4684 950.2602 981.9672 992.2505 998.5415 1038.8216 1048.6466 1063.0332 1077.0873 1118.8206 1165.4257 1169.9613 1240.4016 1241.8215 1286.7508 1299.4969 1313.6507 1333.0650 1357.5793 1393.3770 1415.7188 1423.7881 1440.8153 1472.0597 1475.4402 1482.0276 1486.9202 1505.3564 1536.8173 1572.8512 1585.7272 1606.5892 1620.0395 2966.7707 2983.4152 3054.9045 3080.3133 3090.5919 3138.5688 3156.3822 3174.9839 3189.4975 3484.9917 3564.3449 3722.1399
redmass: 6.1151 6.8049 3.6667 4.6421 4.9670 4.5576 7.5189 6.4012 2.2127 1.5835 6.5778 6.4226 5.2469 4.3318 8.4285 2.9082 6.4294 5.4779 5.7788 3.2836 1.2142 3.8322 2.5672 1.3355 3.2038 6.2510 5.0686 6.8291 1.4457 5.2156 8.4770 3.5922 5.1750 1.2692 6.8451 1.5491 4.0231 1.3503 4.7884 2.9031 1.3573 2.5757 6.3664 1.3158 2.0349 3.0705 1.9306 1.6034 1.6870 2.4290 1.1645 1.7072 1.4621 3.4083 2.1962 1.6726 2.7676 5.3478 1.1963 3.2538 3.6699 2.7829 1.0565 2.9220 1.3426 1.4139 1.5468 3.4691 6.9637 2.9568 2.3485 2.6232 1.0697 1.0358 1.0921 1.0989 1.1007 1.0868 1.0916 1.0982 1.0951 1.0749 1.0444 1.1059
irintensity: 0.0642 0.4970 0.5198 1.7874 0.2498 0.2459 1.1642 0.1706 1.1460 1.3527 2.7954 2.6671 2.9074 6.2308 13.6029 3.0384 0.4759 3.5702 0.8618 1.5323 287.2160 5.1980 8.8634 17.8066 4.9435 16.3425 0.7479 22.7237 37.9590 9.8244 0.1475 1.1140 3.5641 94.3307 30.6212 5.8232 20.3741 5.8078 65.2118 5.6179 4.5479 7.1246 57.1726 3.3069 31.7375 33.0588 20.3094 20.9212 7.7626 7.7408 1.1181 6.1131 21.0470 48.6078 32.7145 10.3233 19.2790 40.9459 13.5381 131.8432 118.5029 211.7132 13.2024 13.4576 88.5458 70.6192 103.8779 1007.1292 277.8550 45.2982 224.3026 448.3996 32.7863 28.7855 0.6036 48.2900 22.4962 5.2865 11.1238 10.0499 26.4382 79.9679 126.2697 46.8141
temp: 298.150 k
press: 1.00000 atm
elementType: 35 17 7 7 7 7 6 6 6 6 6 6 6 6 6 6 6 6 1 1 1 1 1 1 1 1 1 1 1 1
symmnumber: 1
zpe: 587986.9 jmol-1
zpe.correction: 0.223952 hartree
zpe.thermalcorrener: 0.241171 hartree
zpe.thermalcorrenthalpy: 0.242115 hartree
zpe.thermalcorrgfe: 0.176853 hartree
zpe.sumelectzpe: -1155.739522 hartree
zpe.sumelectthermal: -1155.722303 hartree
zpe.sumelectthermalent: -1155.721359 hartree
zpe.sumelectthermalfe: -1155.786621 hartree
dipole: 2.2653 2.1147 0.2756
dipole: 3.1112
quadrupole: -128.4580 -99.7611 -127.0344
quadrupole: -3.1813 -0.8374 1.3233
quadrupole: -10.0402 18.6567 -8.6166 -3.1813 -0.8374 1.3233
hfenergy: -1155.9634741 hartree
pointgroup: C01 [X(C12H12Br1Cl1N4)]
dipole: -1.0295382 -0.6479679 0.1358563 debye
polarizability: 285.8466887|5.0700409|234.0559|-0.1573582|-15.2848273|80.9666765 unknown
InChI: InChI=1S/C12H12BrClN4/c1-2-7-10(14)17-12(15)18-11(7)16-9-6-4-3-5-8(9)13/h3-6,16H,2,15H2,1H3
charge 0 multiplicity 1
30 atoms
Br -2.584805 2.882689 -0.549283
Cl 4.736368 1.015752 -0.372557
N  -0.481909 0.580202 -0.297708
N  0.846435 -1.38066 -0.036281
N  3.276879 -1.22597 -0.063118
N  2.197327 -3.280741 0.225375
C  1.939419 0.810563 -0.36128
C  1.853217 2.313264 -0.549417
C  0.767835 -0.03116 -0.227282
C  -1.786704 0.04878 -0.224871
C  1.66308 3.08706 0.785264
C  3.147582 0.095617 -0.25424
C  -2.898688 0.940631 -0.321946
C  -2.081974 -1.335293 -0.058789
C  2.099797 -1.923527 0.035855
C  -4.229796 0.49735 -0.261927
C  -3.415462 -1.784994 0.002573
C  -4.496441 -0.881569 -0.09783
H  2.783534 2.662269 -1.029503
H  1.039159 2.57233 -1.257882
H  -0.457314 1.595111 -0.432435
H  0.745096 2.778229 1.318141
H  1.598709 4.174151 0.597606
H  2.52007 2.904815 1.45673
H  -1.236318 -2.019277 0.018444
H  -5.04851 1.218099 -0.341325
H  -3.608241 -2.855739 0.130548
H  -5.532083 -1.23206 -0.05031
H  3.119981 -3.70317 0.281678
H  1.353054 -3.839551 0.305568
