program: Gaussian 09
title: 000240796
version: EM64L-G09RevD.01
frameworkgroup: C1[X(C5H7NO)]
method: RPBEPBE
basis: SDD
operation: Freq
keyword: #pfreq=noraman
keyword: PBEPBE/SDD
title: #p freq=noraman PBEPBE/SDD
converged: YES YES NO NO
title: Mulliken charges:
elementType: O N C C C C C H H H H H H H
charge: -0.275052 -0.374531 -0.437451 0.270739 -0.762299 0.210990 -0.478473 0.284652 0.249190 0.311606 0.255263 0.257030 0.210261 0.278075
chargesum: 0.00000
title: Mulliken charges with hydrogens summed into heavy atoms:
elementType: O N C C C C C
charge: -0.275052 -0.062926 0.096392 0.270739 -0.039745 0.210990 -0.200398
polarizability: 8.84231521e+01 -8.01563612e+00 5.34034150e+01 -2.71807426e+00 4.46629247e-01 4.23952702e+01
1716.lowfreq: -6.6456 -0.0003 0.0004 0.0005 4.8703 7.1956 40.7433 72.8182 104.5667
frequency: 40.5868 72.8128 104.5641 221.0703 259.4075 312.8589 381.6812 509.3392 561.3317 596.6939 605.8251 631.2189 667.8062 872.9565 930.9233 983.2536 1011.6389 1041.9377 1092.8044 1225.4881 1249.0245 1340.7200 1387.8420 1450.2936 1463.7487 1470.6204 1481.5283 1620.3279 2145.2919 2973.4780 2998.4981 3033.0749 3100.6964 3102.0521 3426.6077 3567.8236
redmass: 3.4312 1.2468 2.7656 3.2056 4.2887 2.9887 3.6401 2.3537 1.9964 3.1797 2.4843 1.2294 1.2395 3.3237 3.5415 1.6192 2.3789 1.6404 4.0821 1.1082 1.9013 1.3545 1.2280 1.0451 1.2146 1.0834 1.6438 6.6145 6.0094 1.0618 1.0359 1.0969 1.0979 1.1010 1.1597 1.0785
irintensity: 3.8375 4.6147 3.4766 1.8139 11.3950 7.1047 1.9622 43.2594 85.5403 15.2588 6.4049 78.8181 69.6759 2.6275 14.9939 0.8977 6.7537 14.2972 14.8106 17.7551 122.6712 10.8749 58.0836 16.1982 132.8308 5.4311 122.5050 198.4657 2.7991 33.5539 10.7255 12.8425 7.9327 21.7924 66.4768 20.2552
temp: 298.150 k
press: 1.00000 atm
elementType: 8 7 6 6 6 6 6 1 1 1 1 1 1 1
symmnumber: 1
zpe: 286719.9 jmol-1
zpe.correction: 0.109206 hartree
zpe.thermalcorrener: 0.117440 hartree
zpe.thermalcorrenthalpy: 0.118385 hartree
zpe.thermalcorrgfe: 0.075742 hartree
zpe.sumelectzpe: -324.115305 hartree
zpe.sumelectthermal: -324.107070 hartree
zpe.sumelectthermalent: -324.106126 hartree
zpe.sumelectthermalfe: -324.148769 hartree
dipole: 0.9155 -3.3068 1.5084
dipole: 3.7481
quadrupole: -38.5752 -42.7567 -41.4290
quadrupole: 4.5513 -2.2474 1.8342
quadrupole: 2.3451 -1.8364 -0.5087 4.5513 -2.2474 1.8342
hfenergy: -324.2245106 hartree
pointgroup: C01 [X(C5H7N1O1)]
dipole: -0.3041142 -1.2088092 0.7879092 debye
dipolederiv: -0.7234535 -0.0573603 -0.0238116 -0.3047725 -0.7771743 0.2752662 0.1363623 0.3326603 -0.6376178 -1.1979599 -0.2848107 0.1229682 -0.2306532 -0.5190048 -0.0443745 0.0158753 -0.0986363 -0.4581194 0.5801906 -0.0268894 0.014539 -0.3030434 0.1800418 0.1054184 0.2336776 0.1288507 0.3356377 1.4579887 0.4010046 0.0674418 0.6538676 0.9046679 -0.4443286 -0.0086163 -0.45276 0.6188298 -0.3075866 0.0929112 -0.1925846 0.0521389 0.0085758 0.040109 -0.2002307 0.0417676 -0.0935413 0.0799932 0.0060643 -0.1511029 0.0450078 -0.0639041 -0.0034953 -0.1956642 -0.0160292 -0.0556574 -0.5192822 -0.0035853 0.0441373 -0.0003632 -0.324214 0.0048883 0.1432904 -0.0003861 -0.3317233 0.1554966 -0.0312091 0.0659316 0.0962885 0.0515308 0.0413629 -0.0205188 0.0221269 0.1040336 -0.0672733 -0.0110234 -0.0033243 0.0116385 0.0225203 -0.142908 -0.0695976 -0.103706 -0.0259912 0.1688182 -0.0345177 -0.0482593 -0.0232 0.2148708 0.1192876 -0.0770672 0.1148217 0.2162309 -0.0086421 0.0499486 0.0684974 0.0641447 0.0990057 0.0022735 0.099162 -0.0283459 0.03102 0.0978467 -0.0276666 -0.0307869 -0.0443097 -0.0150856 -0.0887373 -0.0686153 -0.0553672 0.0439889 0.0472534 -0.0816918 0.0410435 -0.0210235 -0.0480713 0.1366482 -0.0094451 0.1150601 0.0115782 0.2366103 0.0088253 0.0253107 0.0042795 0.266241 -0.0014103 0.0213876 -0.0000567 0.2413314 unknown
polarizability: 87.8094426|3.1258524|45.3131049|-9.07686|-5.1175856|51.0992897 unknown
InChI: InChI=1S/C5H7NO/c1-3-4-6-5(2)7/h1,6H,4H2,2H3
charge 0 multiplicity 1
14 atoms
O  1.647268 1.014384 -0.923685
N  0.31539 -0.656161 -0.006121
C  -0.871258 -0.274077 -0.794442
C  1.511703 0.042606 -0.12009
C  2.644242 -0.441824 0.779382
C  -2.084398 -0.131122 0.032117
C  -3.11025 -0.034265 0.708878
H  -0.608916 0.682116 -1.286773
H  -1.059248 -1.014369 -1.597777
H  0.227648 -1.418868 0.666187
H  3.501081 -0.738833 0.150628
H  2.980466 0.397486 1.412022
H  2.364753 -1.289775 1.427987
H  -4.002979 0.063903 1.299186
