program: Gaussian 09
title: 000240754
version: EM64L-G09RevD.01
frameworkgroup: C1[X(C17H15NO2)]
method: RPBEPBE
basis: SDD
operation: Freq
keyword: #p
keyword: freq=noraman
keyword: PBEPBE/SDD
title: #p freq=noraman PBEPBE/SDD
converged: YES YES NO NO
title: Mulliken charges:
elementType: O O N C C C C C C C C C C C C C C C C C H H H H H H H H H H H H H H H
charge: -0.443190 -0.245072 -0.164493 0.382637 0.103590 -0.704432 0.249775 -0.435098 0.447978 -0.388764 -0.347427 -0.638210 0.092520 -0.264463 -0.230288 -0.415628 -0.328225 -0.234399 -0.237924 0.080863 0.221314 0.262057 0.263903 0.235172 0.229672 0.237746 0.230259 0.236892 0.218104 0.242705 0.217245 0.277444 0.231232 0.233985 0.382520
chargesum: 0.00000
title: Mulliken charges with hydrogens summed into heavy atoms:
elementType: O O N C C C C C C C C C C C C C C C C C
charge: -0.060670 -0.245072 -0.164493 0.382637 0.103590 -0.221061 0.249775 -0.171195 0.447978 -0.153592 -0.117755 0.066687 0.092520 -0.046359 -0.013043 -0.172923 -0.050781 -0.003167 -0.003940 0.080863
polarizability: 2.50629379e+02 4.43261832e+01 1.91100872e+02 -5.25937663e-01 3.42292941e+00 1.42884001e+02
1716.lowfreq: -7.1042 -0.0007 -0.0007 -0.0004 6.3636 6.9527 13.2545 25.1924 45.6364
frequency: 11.2786 24.9638 45.6211 59.2492 79.1072 121.4770 129.4159 134.6758 155.1151 224.1968 227.7971 246.0064 259.3480 313.2029 352.5065 386.4895 417.2646 424.7511 459.8587 504.8915 520.2291 531.3788 563.1335 572.1254 587.7005 591.9013 601.4972 613.2345 646.8479 694.1332 713.1396 746.6821 751.7119 757.2016 762.2727 791.7626 793.5727 808.5981 835.2037 848.0576 897.9422 928.8256 933.7446 968.4024 974.2437 994.3345 1001.1947 1004.0642 1012.0228 1040.7247 1051.1269 1105.6535 1118.2729 1118.7100 1131.0242 1158.5022 1169.4039 1176.5121 1186.9565 1202.8195 1209.0416 1248.1648 1292.5426 1305.2357 1307.9534 1336.5723 1366.2904 1371.9412 1384.4017 1412.4567 1430.8067 1433.4846 1464.4838 1466.4568 1472.2050 1479.1735 1480.5348 1496.2747 1553.4771 1579.1744 1581.9976 1605.5993 1626.0731 1640.7303 2972.8669 2976.7247 3047.9617 3068.2695 3103.6317 3121.6244 3122.7145 3134.1394 3138.9044 3147.7960 3157.4280 3162.3068 3181.3573 3211.3063 3527.6688
redmass: 5.0658 6.1512 6.2296 7.0664 1.1052 4.1013 4.6333 2.8125 5.5088 3.8504 4.2405 4.6338 3.7312 5.9229 2.8438 4.8711 3.0640 2.8114 4.4717 4.2542 3.8689 5.8005 5.1980 3.7714 3.3995 1.3691 4.1828 4.7883 3.6336 3.6290 4.5737 1.3458 3.6197 2.6894 4.0859 1.6224 2.0246 2.8970 3.2340 1.5375 1.5615 1.4337 1.8047 1.3046 1.4085 5.0981 1.3636 4.3630 2.1042 2.3739 2.2195 1.9246 1.3101 2.0635 1.6108 1.7361 1.1478 1.0968 1.2603 1.4261 2.3039 1.7182 1.4124 1.4776 2.6119 2.4838 3.1210 3.6963 5.6248 4.2949 2.1525 1.5268 1.1541 1.0432 2.5611 2.5784 2.5995 1.1828 5.3438 6.6912 6.6687 6.2843 7.2468 8.0496 1.0359 1.0681 1.1018 1.0915 1.0983 1.0870 1.0845 1.0889 1.0906 1.0952 1.0964 1.1000 1.0962 1.0977 1.0641
irintensity: 0.1079 0.2327 1.1176 1.2343 0.2577 0.6039 1.0442 3.3542 1.1618 2.6800 1.9620 0.6956 1.4036 0.4392 6.8140 2.0390 8.0394 9.6562 6.9220 7.2402 3.3915 4.3080 9.5827 0.1243 16.2953 88.1537 18.0111 21.1629 2.8982 67.4166 2.3221 107.4112 16.2055 28.5866 5.3819 19.4149 18.5384 1.8219 6.4023 0.7819 0.8021 6.0105 4.3296 0.0527 6.7334 232.7993 2.1155 6.4719 16.7767 10.8128 11.8318 48.4050 0.4886 13.5976 17.4059 85.2053 5.4585 2.2774 7.3027 10.8626 0.7046 20.3744 2.3312 2.6778 69.2611 37.3947 16.2445 5.8739 2.6411 22.3785 4.3681 0.6367 32.1908 11.8107 12.2378 25.5022 40.5708 10.7754 10.4022 14.1537 4.1005 9.5686 3.7452 251.9315 85.6338 35.6845 28.6006 0.7669 11.6941 5.6246 0.0218 11.5796 15.2805 39.2487 24.7351 28.0601 9.0953 0.8106 39.4730
temp: 298.150 k
press: 1.00000 atm
elementType: 8 8 7 6 6 6 6 6 6 6 6 6 6 6 6 6 6 6 6 6 1 1 1 1 1 1 1 1 1 1 1 1 1 1 1
symmnumber: 1
zpe: 724349.9 jmol-1
zpe.correction: 0.275890 hartree
zpe.thermalcorrener: 0.293099 hartree
zpe.thermalcorrenthalpy: 0.294043 hartree
zpe.thermalcorrgfe: 0.228374 hartree
zpe.sumelectzpe: -860.628536 hartree
zpe.sumelectthermal: -860.611327 hartree
zpe.sumelectthermalent: -860.610383 hartree
zpe.sumelectthermalfe: -860.676053 hartree
dipole: 1.3335 3.0140 1.5864
dipole: 3.6577
quadrupole: -106.7388 -103.5718 -112.2400
quadrupole: -0.0722 -4.6117 -0.0708
quadrupole: 0.7780 3.9451 -4.7231 -0.0722 -4.6117 -0.0708
hfenergy: -860.9044265 hartree
pointgroup: C01 [X(C17H15N1O2)]
dipole: 0.4722665 1.2144227 0.6107322 debye
polarizability: 249.2348717|44.9304341|192.5560366|4.162785|4.3343103|142.8233446 unknown
InChI: InChI=1S/C17H15NO2/c1-18-11-13(14-7-4-5-9-16(14)18)10-12-6-2-3-8-15(12)17(19)20/h2-9,11,19H,10H2,1H3
charge 0 multiplicity 1
35 atoms
O  2.055523 -2.127585 2.161793
O  0.783097 -2.376312 0.24916
N  -1.977671 1.778857 0.489694
C  -0.554345 0.450925 -0.733392
C  -1.847331 -0.205203 -0.655558
C  0.67124 -0.042321 -1.484847
C  -2.717524 0.650924 0.111356
C  -0.675887 1.647596 -0.024377
C  1.974646 0.22909 -0.739652
C  -2.352442 -1.439542 -1.141371
C  -4.062183 0.313297 0.38626
C  -2.482628 2.888113 1.297187
C  2.406723 -0.523716 0.400274
C  -3.691408 -1.781678 -0.870729
C  -4.538617 -0.914045 -0.117895
C  2.780619 1.319292 -1.154197
C  3.598144 -0.159928 1.08593
C  3.968745 1.671174 -0.476386
C  4.378625 0.930147 0.655107
C  1.658189 -1.724322 0.869452
H  0.728694 0.451617 -2.475263
H  0.555897 -1.123924 -1.663579
H  0.072629 2.415717 0.165364
H  -1.706746 -2.122917 -1.703124
H  -4.715312 0.972526 0.968833
H  -2.833129 2.533464 2.284668
H  -1.675552 3.620355 1.459158
H  -3.322014 3.400964 0.790799
H  -4.092893 -2.733579 -1.236169
H  2.462435 1.899625 -2.028541
H  -5.576043 -1.210231 0.075153
H  3.901298 -0.750171 1.954497
H  4.568896 2.517413 -0.829532
H  5.296734 1.194727 1.190178
H  1.531988 -2.938548 2.40295
