program: Gaussian 09
title: 000240745
version: EM64L-G09RevD.01
frameworkgroup: C1[X(C10H9ClO4)]
method: RPBEPBE
basis: SDD
operation: Freq
keyword: #p
keyword: freq=noraman
keyword: PBEPBE/SDD
title: #p freq=noraman PBEPBE/SDD
converged: YES YES NO NO
title: Mulliken charges:
elementType: Cl O O O O C C C C C C C C C C H H H H H H H H H
charge: 0.031954 -0.224008 -0.271874 -0.286755 -0.194147 0.389040 0.191151 -0.415236 -0.567954 -0.494061 0.253305 0.260297 0.156631 -0.495617 -0.522872 0.246468 0.246261 0.272817 0.241581 0.237584 0.234048 0.245472 0.241369 0.224549
chargesum: 0.00000
title: Mulliken charges with hydrogens summed into heavy atoms:
elementType: Cl O O O O C C C C C C C C C C
charge: 0.031954 -0.224008 -0.271874 -0.286755 -0.194147 0.389040 0.191151 0.077492 -0.295138 -0.494061 0.253305 0.260297 0.156631 0.217596 0.188518
polarizability: 1.79115826e+02 -3.75406484e+00 1.56261990e+02 -1.73626044e-01 -3.51950738e+00 6.77100920e+01
1716.lowfreq: -8.0243 -2.7177 0.0012 0.0013 0.0020 5.5783 49.9359 71.3539 80.5033
frequency: 49.9071 71.3514 80.5014 88.6658 125.6926 146.9580 168.6519 178.2442 186.9677 199.7752 224.6985 262.2075 287.9383 322.4137 350.8813 389.2798 436.6476 458.3541 525.8074 558.6866 574.9403 634.5530 657.0422 704.4881 710.0670 751.6690 779.6772 838.1547 873.9350 914.2932 936.2516 953.0005 993.8192 998.4269 1088.6968 1105.0543 1110.0238 1139.7433 1141.1096 1150.5650 1171.0465 1179.8165 1289.5932 1300.8942 1369.4961 1389.3322 1423.1849 1443.8790 1453.0619 1454.6311 1458.4760 1460.2562 1461.5811 1472.1757 1568.6539 1618.6413 1708.6258 2974.4333 3003.5797 3010.7920 3067.1951 3074.8570 3115.4470 3127.6893 3129.4804 3166.9352
redmass: 3.1178 6.1613 2.9880 3.6673 2.3510 1.0900 2.0382 14.6017 4.5278 3.3558 2.7573 5.8117 7.1355 10.4188 4.7278 8.1425 7.6736 6.0159 8.3234 4.0864 7.7730 5.9529 7.2355 7.3402 8.1386 7.9104 7.2602 9.4317 1.4291 8.0821 7.7346 11.1204 5.2741 1.7624 5.2586 1.2519 1.2660 1.0746 1.8925 1.3666 3.8008 1.4740 6.1830 1.5677 5.0844 3.8633 2.0435 1.4582 1.0942 1.3752 1.0663 1.0723 1.2339 1.0535 9.7283 8.4722 12.9552 1.0318 1.0285 1.0575 1.1070 1.1035 1.1047 1.1058 1.1024 1.0930
irintensity: 2.5280 1.5695 8.8290 4.2904 0.6920 0.2469 7.2296 1.8143 3.2762 3.2122 3.5598 2.5471 4.5939 0.7315 4.8898 1.0845 2.1642 4.9123 11.6666 3.4695 9.3452 4.8967 7.9681 0.4543 6.2621 1.8453 22.8865 103.3639 26.7533 29.2334 164.3901 57.7316 3.0776 1.3275 82.5435 3.4147 6.2138 0.1373 26.3098 2.0096 17.8635 11.7139 263.2718 13.5908 170.1567 62.0809 3.4339 33.4787 18.5218 31.4969 36.2298 9.9397 0.1522 10.0467 53.7492 145.0478 372.5306 55.8656 64.5274 25.5209 9.3781 23.7227 29.7882 22.4438 19.4013 1.4393
temp: 298.150 k
press: 1.00000 atm
elementType: 17 8 8 8 8 6 6 6 6 6 6 6 6 6 6 1 1 1 1 1 1 1 1 1
symmnumber: 1
zpe: 448975.8 jmol-1
zpe.correction: 0.171006 hartree
zpe.thermalcorrener: 0.185561 hartree
zpe.thermalcorrenthalpy: 0.186506 hartree
zpe.thermalcorrgfe: 0.128942 hartree
zpe.sumelectzpe: -1146.280729 hartree
zpe.sumelectthermal: -1146.266174 hartree
zpe.sumelectthermalent: -1146.265229 hartree
zpe.sumelectthermalfe: -1146.322793 hartree
dipole: 6.1325 -3.4461 1.1293
dipole: 7.1245
quadrupole: -100.7044 -88.1156 -90.9814
quadrupole: 11.7694 0.0017 4.5391
quadrupole: -7.4373 5.1515 2.2857 11.7694 0.0017 4.5391
hfenergy: -1146.451735 hartree
pointgroup: C01 [X(C10H9Cl1O4)]
dipole: 2.4029622 1.371503 -0.4489485 debye
dipolederiv: -0.0519644 -0.0115654 0.0109731 0.0208102 -0.6689972 0.1286997 0.0048944 0.1083403 -0.0405799 -0.6796192 0.2853768 -0.0737737 0.1608312 -0.9232535 0.124419 -0.0517508 0.1346976 -0.3267164 -1.7438688 -0.4319965 -0.2178263 -0.4391731 -0.4320196 -0.0745262 -0.0222691 0.0193572 -0.3297434 -0.8846781 0.3753916 0.161253 0.5186038 -0.7348986 -0.1765597 0.07908 -0.1020696 -0.3669293 -0.8580441 -0.3280615 0.0307105 -0.4365363 -0.8969412 0.0838485 0.0451101 0.085156 -0.3238938 0.2791333 0.0162992 0.0371742 0.1923555 0.1746808 -0.0180647 -0.0000183 -0.0471257 -0.0508667 -0.969783 -0.1153338 -0.038517 -0.1311038 -0.4755927 0.0691276 -0.04528 0.078109 0.0208571 0.211178 0.1738127 -0.0425049 0.0450871 0.3324506 0.0016862 -0.0145754 0.0185886 0.3295708 -0.5547359 -0.0395135 -0.0645777 0.1188879 0.0358136 -0.041811 -0.1180838 -0.0741201 -0.1732505 0.3946763 0.1823307 0.0165944 -0.0896475 1.0353539 -0.2330738 0.0620504 -0.1938496 -0.0032301 1.3144082 0.4060811 0.1402507 0.7821738 0.472183 0.083422 -0.0894066 -0.0394348 0.0690204 0.4522548 -0.5053281 -0.0983004 -0.862949 -0.0425447 0.0451661 0.1776163 0.0025173 -0.0601698 1.7974602 0.0587131 0.0838188 0.4176253 1.4948225 -0.2108825 0.019869 -0.2167213 0.2974224 0.8980682 0.1402605 0.1528231 -0.1833492 0.2188052 -0.0034207 0.2885092 0.0832845 0.3494635 0.3247107 -0.1091626 -0.1243025 -0.2279669 0.4430736 0.1447974 -0.3088798 0.2231091 0.4399112 0.0311171 -0.0008603 0.0244876 0.0191375 -0.0480938 -0.0588698 0.0429932 -0.1115524 0.0257202 0.040826 -0.0187863 -0.0120372 -0.0063075 0.0174471 0.0604159 -0.0383372 0.1104142 -0.0484063 0.0911267 -0.0047571 0.0001558 -0.022095 -0.0285506 0.0262426 -0.017366 0.0268786 0.1667767 -0.0317046 0.0547304 0.0129196 0.1857151 0.0047311 -0.0529889 0.0114058 -0.0913838 0.002657 -0.0147619 -0.0296 0.0742961 0.0575294 0.0904399 0.0823709 -0.0551787 0.0223344 -0.0922791 -0.056279 -0.0979777 -0.0421937 -0.1480796 -0.0679379 -0.029775 -0.0543494 -0.0082825 0.1035326 0.0134114 -0.128858 -0.0704686 -0.0370625 -0.0021421 -0.0731433 0.0099954 -0.0608834 0.0331692 -0.0594581 0.1268668 -0.0206992 0.1152515 0.0362642 0.0046134 -0.0443526 0.0215616 0.0620842 0.056526 0.0019376 0.0597445 -0.0497377 -0.0350938 0.1183064 0.1183238 0.0110747 -0.0841199 unknown
polarizability: 178.7284407|4.7314289|155.3498209|4.7302891|-10.2148801|69.0096463 unknown
InChI: InChI=1S/C10H9ClO4/c1-13-6-3-5-4-15-10(12)7(5)8(11)9(6)14-2/h3H,4H2,1-2H3
charge 0 multiplicity 1
24 atoms
Cl -0.306519 -2.65205 0.578483
O  -3.41315 0.821665 -0.274393
O  2.535215 1.761282 -0.026989
O  2.311663 -1.122213 0.418579
O  -3.320653 -1.472957 0.160756
C  -1.085317 1.311833 -0.214711
C  -1.262063 -0.071546 0.029708
C  -2.449172 1.939434 -0.420207
C  0.179285 1.90546 -0.217984
C  -0.132475 -0.882136 0.250533
C  1.318045 1.089756 0.012427
C  1.170111 -0.324137 0.215527
C  -2.711827 -0.405718 0.000974
C  3.692293 1.301241 0.775664
C  2.745004 -1.892765 -0.773678
H  -2.695539 2.702184 0.339817
H  -2.580018 2.371634 -1.428334
H  0.33303 2.975835 -0.380452
H  4.229793 0.486155 0.267093
H  3.369858 0.95835 1.772916
H  4.331356 2.194023 0.858627
H  1.943139 -2.571683 -1.113521
H  3.612814 -2.480096 -0.438928
H  3.035927 -1.206752 -1.592006
