program: Gaussian 09
title: 000240765
version: EM64L-G09RevD.01
frameworkgroup: C1[X(C16H15N3O3)]
method: RPBEPBE
basis: SDD
operation: Freq
keyword: #p
keyword: freq=noraman
keyword: PBEPBE/SDD
title: #p freq=noraman PBEPBE/SDD
converged: YES YES NO NO
title: Mulliken charges:
elementType: O O O N N N C C C C C C C C C C C C C C C C H H H H H H H H H H H H H H H
charge: -0.265199 -0.171121 -0.199023 -0.063045 -0.099953 0.006020 -0.383862 0.148989 0.316415 0.228959 -0.278769 -0.274675 -0.254564 0.175885 -0.334813 -0.361922 -0.663147 -0.335515 -0.281239 -0.202699 -0.197840 -0.228062 0.272193 0.272873 0.269893 0.227495 0.238759 0.249121 0.244923 0.219634 0.251852 0.226578 0.250508 0.287828 0.236141 0.235773 0.235608
chargesum: 0.00000
title: Mulliken charges with hydrogens summed into heavy atoms:
elementType: O O O N N N C C C C C C C C C C C C C C C C
charge: -0.265199 -0.171121 -0.199023 -0.063045 -0.099953 0.006020 -0.111669 0.148989 0.316415 0.228959 -0.005896 -0.004782 0.211691 0.175885 -0.085692 -0.116999 0.034917 -0.085007 0.006589 0.033442 0.037932 0.007546
polarizability: 2.87022212e+02 1.53690833e+01 2.06758869e+02 2.26712527e+01 -2.18975892e+01 1.61278897e+02
1716.lowfreq: -7.2930 -4.1951 -0.3598 -0.0009 -0.0007 -0.0004 10.7275 19.7386 25.5167
frequency: 9.9374 19.6834 25.4621 42.5983 47.9715 49.7829 72.9501 88.3067 103.7099 134.1136 137.5738 154.4142 195.4005 219.9208 241.3126 273.3959 296.6842 307.9453 327.1601 365.7891 376.3029 405.9445 424.3957 434.0205 467.3442 507.2409 517.6495 566.4072 608.5791 633.9176 650.2850 658.8932 690.3667 698.9899 713.5497 749.9372 780.6283 794.7222 814.1535 815.3573 843.0281 849.6415 856.1142 893.8086 925.7965 949.1704 957.7776 974.7938 984.1130 987.3570 990.8109 991.6167 993.2578 1007.2893 1016.3666 1024.3239 1062.8468 1079.5044 1092.6757 1096.1201 1120.9633 1153.8125 1157.9428 1173.1459 1194.6600 1212.3107 1221.7680 1256.5334 1277.1852 1298.9479 1304.2565 1309.7119 1334.7088 1355.8869 1391.9562 1392.2952 1394.0202 1402.1706 1444.6950 1458.6587 1463.2071 1464.1830 1466.5575 1485.0473 1542.5400 1576.6479 1585.5806 1598.5057 1604.0165 1661.4726 2994.1546 3011.6811 3034.0330 3089.4672 3095.7544 3122.2561 3133.5079 3135.5388 3142.3344 3144.5299 3155.3217 3157.1490 3168.2535 3172.6949 3175.2307
redmass: 4.6889 3.7217 5.5104 5.7770 3.6522 4.0890 5.2577 5.4117 5.9838 5.3539 6.1879 6.5836 1.8515 4.4995 2.4555 6.8986 4.5935 3.9514 7.2995 2.6572 5.1777 2.8808 4.6525 5.6722 5.5326 5.9876 3.5961 7.4981 6.4836 6.6630 5.6908 6.9572 1.9732 5.4431 3.9190 2.9795 1.7405 1.8971 3.2266 2.3276 2.0521 3.5965 1.2567 1.2597 3.9969 1.4368 5.5568 1.9777 2.3245 5.8538 1.7785 2.2857 1.7273 1.3352 2.1462 3.5900 2.0489 1.4893 1.7595 2.1669 3.6043 1.6734 1.6736 1.0635 1.7201 2.1506 1.2958 2.0893 1.1188 6.4580 1.6599 1.3810 1.3611 1.2853 5.2366 1.3851 7.7349 1.9299 2.3995 1.0877 1.9005 1.0463 2.1875 1.0517 7.6964 5.2405 6.1623 9.3814 6.4414 10.5973 1.0360 1.0817 1.0596 1.0974 1.1030 1.1067 1.0855 1.0884 1.0899 1.0888 1.0931 1.0975 1.0965 1.0967 1.1004
irintensity: 0.4059 0.2776 0.5300 1.3727 0.6395 0.7336 0.1446 1.7517 1.3569 0.8314 3.2319 6.0371 3.1729 0.3736 0.3664 1.6047 10.8501 12.0837 6.4211 0.5047 1.7577 0.0580 1.7542 8.9362 3.9744 8.5184 8.9637 19.4057 0.1796 9.8156 34.9683 2.2949 34.7233 3.6425 11.8401 9.5078 68.8283 12.2108 20.6800 1.2952 21.1800 25.6796 0.5568 0.9630 45.1871 12.2253 0.9445 5.2793 3.6091 5.5839 23.6944 36.0305 18.0114 0.3605 1.9555 94.7454 5.2888 9.7058 16.7341 51.4429 435.0198 28.7808 12.9277 0.4148 12.5656 53.0338 8.4665 207.3558 5.4299 5.9971 63.2856 13.8583 13.3243 2.8648 7.4661 24.0341 19.9836 32.9783 11.1498 11.7732 1.9548 12.6700 6.8304 12.9744 46.4041 7.2367 5.2517 141.4017 5.1676 149.9442 19.5618 16.7081 26.0579 35.2831 1.7144 28.8549 0.3913 14.1050 13.4399 6.8648 17.5338 8.5214 11.9241 11.3603 24.0991
temp: 298.150 k
press: 1.00000 atm
elementType: 8 8 8 7 7 7 6 6 6 6 6 6 6 6 6 6 6 6 6 6 6 6 1 1 1 1 1 1 1 1 1 1 1 1 1 1 1
symmnumber: 1
zpe: 735909.8 jmol-1
zpe.correction: 0.280293 hartree
zpe.thermalcorrener: 0.300711 hartree
zpe.thermalcorrenthalpy: 0.301656 hartree
zpe.thermalcorrgfe: 0.226305 hartree
zpe.sumelectzpe: -1006.992037 hartree
zpe.sumelectthermal: -1006.971619 hartree
zpe.sumelectthermalent: -1006.970675 hartree
zpe.sumelectthermalfe: -1007.046025 hartree
dipole: -1.4767 -0.9522 -2.2029
dipole: 2.8178
quadrupole: -96.9041 -139.0195 -125.6694
quadrupole: -3.8852 -1.8393 5.2938
quadrupole: 23.6269 -18.4885 -5.1384 -3.8852 -1.8393 5.2938
hfenergy: -1007.2723303 hartree
pointgroup: C01 [X(C16H15N3O3)]
dipole: -0.6436855 -0.3589199 -0.8281801 debye
polarizability: 288.603298|16.86051|211.114559|11.9799268|-19.407141|155.342121 unknown
InChI: InChI=1S/C16H15N3O3/c1-2-22-16(21)14(15(20)12-8-10-17-11-9-12)19-18-13-6-4-3-5-7-13/h3-11,14H,2H2,1H3
charge 0 multiplicity 1
37 atoms
O  3.170084 -1.482536 -0.691789
O  2.389517 0.339956 1.715999
O  1.703737 -2.895377 0.457913
N  -0.284747 -0.907212 0.428527
N  -1.242227 -0.520945 -0.357575
N  0.766629 4.744494 -0.273375
C  1.063545 -0.558203 -0.132268
C  1.662208 0.59896 0.722625
C  1.322521 2.012404 0.34507
C  1.971908 -1.793833 -0.054786
C  1.958248 3.067829 1.052231
C  0.392748 2.354018 -0.672179
C  4.224037 -2.547714 -0.690046
C  -2.569504 -0.836014 0.103885
C  1.656339 4.401072 0.709733
C  0.150587 3.721258 -0.936783
C  4.026339 -3.509358 -1.864373
C  -3.62125 -0.374618 -0.727539
C  -2.853849 -1.567689 1.290775
C  -4.962013 -0.634815 -0.373258
C  -4.193752 -1.824106 1.634105
C  -5.249512 -1.359087 0.807215
H  0.98912 -0.238793 -1.189482
H  2.671942 2.830186 1.846658
H  -0.155197 1.58817 -1.229746
H  5.162757 -1.977307 -0.770076
H  4.180285 -3.07566 0.278444
H  2.135692 5.237556 1.229587
H  -0.564326 4.020489 -1.711169
H  4.859996 -4.235382 -1.892508
H  3.084206 -4.07198 -1.755963
H  4.012113 -2.964071 -2.823833
H  -3.365872 0.17849 -1.637518
H  -2.022263 -1.919653 1.909043
H  -5.776627 -0.277956 -1.012023
H  -4.424331 -2.388191 2.544391
H  -6.289688 -1.564384 1.083491
