program: Gaussian 09
title: 000240753
version: EM64L-G09RevD.01
frameworkgroup: C1[X(C16H13NO2)]
method: RPBEPBE
basis: SDD
operation: Freq
keyword: #p
keyword: freq=noraman
keyword: PBEPBE/SDD
title: #p freq=noraman PBEPBE/SDD
converged: YES YES NO NO
title: Mulliken charges:
elementType: O O N C C C C C C C C C C C C C C C C H H H H H H H H H H H H H
charge: -0.442952 -0.245619 -0.421615 0.347722 -0.668814 0.119672 0.235105 0.429691 -0.406438 -0.393552 0.090974 -0.350799 -0.413203 -0.260423 -0.218267 -0.331202 -0.235561 -0.235965 0.080090 0.220147 0.261797 0.270879 0.301216 0.231171 0.224866 0.246485 0.218458 0.218889 0.278059 0.232201 0.234310 0.382678
chargesum: 0.00000
title: Mulliken charges with hydrogens summed into heavy atoms:
elementType: O O N C C C C C C C C C C C C C C C C
charge: -0.060275 -0.245619 -0.120399 0.347722 -0.186869 0.119672 0.235105 0.429691 -0.135559 -0.162381 0.090974 -0.125934 -0.166718 -0.041965 0.000623 -0.053143 -0.003360 -0.001655 0.080090
polarizability: 2.51820586e+02 3.71766686e+01 1.56324670e+02 -1.58373869e+01 -6.10810815e+00 1.41077911e+02
1716.lowfreq: -0.0006 -0.0005 0.0003 2.2243 3.4191 7.8837 10.7035 24.5406 41.4818
frequency: 10.6278 24.2358 41.4798 63.5046 122.3142 127.2968 152.6001 218.9172 235.7776 247.3005 303.4900 347.9947 381.9676 417.2097 420.7974 444.5020 473.2963 494.9041 505.6815 542.4669 573.4379 575.1970 591.3735 599.7773 607.1722 626.0005 690.9249 707.3974 720.4015 747.3197 753.7174 758.1674 788.8212 793.6020 805.1710 834.5418 848.7865 867.5360 898.5159 928.7175 938.7535 969.8245 974.0617 993.5778 1001.4021 1011.1605 1037.5062 1050.5533 1095.5048 1106.2982 1130.3833 1158.7349 1166.1483 1176.1208 1191.4667 1206.1462 1233.2954 1245.0773 1284.6566 1297.3366 1300.8950 1307.2716 1354.7155 1381.8072 1390.7801 1420.7485 1430.6600 1460.1657 1461.7826 1480.5391 1482.7543 1561.3307 1579.3521 1587.3124 1606.5688 1632.1748 1641.8201 2973.9418 3057.8984 3121.9075 3124.4948 3130.6830 3140.4981 3144.4670 3158.2665 3161.6542 3180.8171 3223.7942 3525.4125 3615.6101
redmass: 5.5789 5.6055 9.8670 5.5684 4.3680 4.6250 5.5466 4.1039 5.1364 5.2505 6.1092 2.6798 5.1918 3.0824 2.8201 4.5463 4.0870 1.2321 4.2156 6.8473 5.2657 3.1516 1.2941 3.2424 4.6791 4.0709 4.1622 3.6365 4.1141 1.3643 4.0470 3.1599 1.8964 2.1827 1.7578 3.8499 1.4739 5.0338 1.5415 1.4280 1.8185 1.3034 1.4104 5.0887 1.3603 2.1107 3.5997 2.5608 1.6359 1.9165 1.4434 1.7576 1.0902 1.0917 1.1302 2.2442 2.5301 1.6420 1.7820 1.6018 1.6320 2.6167 1.7997 7.2865 5.4900 2.3696 2.1627 4.2826 1.1383 2.5890 3.0440 5.4611 6.6825 6.1283 6.2998 6.8857 8.0695 1.0674 1.0919 1.0848 1.0867 1.0888 1.0908 1.0952 1.0964 1.1002 1.0965 1.0982 1.0641 1.0808
irintensity: 0.0026 0.3734 1.5882 0.3447 0.5434 0.4293 0.7387 8.3110 1.5504 1.4313 0.1142 6.8461 1.2587 8.6658 12.0830 5.4337 6.9588 87.5716 11.6303 0.7290 6.2666 10.3776 98.3977 8.7225 37.7200 1.4224 49.9524 17.9303 20.1594 103.0069 10.6363 13.4389 32.7201 14.7019 8.3831 5.8989 0.7859 1.4625 0.7166 7.3190 4.8858 0.0459 7.4107 242.7781 2.6668 12.8267 2.5486 18.7113 33.8866 50.7349 3.9573 81.9236 1.2458 1.4503 6.6552 2.5184 21.4358 1.9233 1.2409 0.1744 3.3672 70.5934 30.3698 0.8490 28.9142 2.3569 3.3452 20.7828 23.2709 24.2520 4.8698 2.8038 17.0984 1.7538 8.6112 2.1915 252.9016 35.6336 0.6274 1.1327 4.3168 7.0538 15.5750 38.8200 23.9591 31.6932 9.4741 0.7974 40.4002 52.4947
temp: 298.150 k
press: 1.00000 atm
elementType: 8 8 7 6 6 6 6 6 6 6 6 6 6 6 6 6 6 6 6 1 1 1 1 1 1 1 1 1 1 1 1 1
symmnumber: 1
zpe: 653167.5 jmol-1
zpe.correction: 0.248778 hartree
zpe.thermalcorrener: 0.264210 hartree
zpe.thermalcorrenthalpy: 0.265154 hartree
zpe.thermalcorrgfe: 0.203377 hartree
zpe.sumelectzpe: -821.410438 hartree
zpe.sumelectthermal: -821.395006 hartree
zpe.sumelectthermalent: -821.394062 hartree
zpe.sumelectthermalfe: -821.455839 hartree
dipole: -1.7260 -1.9357 2.1785
dipole: 3.3871
quadrupole: -100.6022 -102.1305 -101.6789
quadrupole: 2.2126 3.1987 -1.5915
quadrupole: 0.8684 -0.6600 -0.2084 2.2126 3.1987 -1.5915
hfenergy: -821.6592167 hartree
pointgroup: C01 [X(C16H13N1O2)]
dipole: 0.6340947 0.9521618 0.6834191 debye
polarizability: 251.3037106|37.79066|156.7535212|16.3915467|4.8879316|141.1659347 unknown
InChI: InChI=1S/C16H13NO2/c18-16(19)14-7-2-1-5-11(14)9-12-10-17-15-8-4-3-6-13(12)15/h1-8,10,17-18H,9H2
charge 0 multiplicity 1
32 atoms
O  2.054673 -2.294348 2.150085
O  0.637716 -2.393368 0.327128
N  -1.886143 1.762934 1.074357
C  -0.652725 0.552933 -0.426196
C  0.4966 0.034246 -1.272147
C  -2.044779 0.150594 -0.535557
C  -2.796481 0.927274 0.417333
C  1.856079 0.220347 -0.609083
C  -0.597529 1.534168 0.563841
C  -2.729017 -0.800201 -1.338158
C  2.3397 -0.609581 0.453793
C  -4.192375 0.782975 0.578807
C  2.666488 1.309528 -1.017136
C  -4.120448 -0.94954 -1.181878
C  -4.845127 -0.165315 -0.234977
C  3.590346 -0.324968 1.068516
C  3.91192 1.583522 -0.410254
C  4.376294 0.763026 0.642864
C  1.580605 -1.80782 0.913371
H  0.506198 0.5647 -2.24552
H  0.319053 -1.0344 -1.481079
H  0.26299 2.07951 0.94685
H  -2.115292 2.416365 1.819267
H  -2.183043 -1.41598 -2.061566
H  -4.752776 1.379788 1.307557
H  2.303999 1.952433 -1.827818
H  -4.660326 -1.68233 -1.791968
H  -5.927605 -0.305357 -0.136999
H  3.933304 -0.973702 1.878572
H  4.513446 2.431513 -0.756507
H  5.339838 0.966002 1.122032
H  1.521113 -3.10035 2.385973
