program: Gaussian 09
title: 000240746
version: EM64L-G09RevD.01
frameworkgroup: C1[X(C10H9IO4)]
method: RPBEPBE
basis: SDD
operation: Freq
keyword: #p
keyword: freq=noraman
keyword: PBEPBE/SDD
title: #p freq=noraman PBEPBE/SDD
converged: NO YES NO NO
title: Mulliken charges:
elementType: I O O O O C C C C C C C C C C H H H H H H H H H
charge: 0.170276 -0.221927 -0.290775 -0.288107 -0.192148 0.382989 0.160323 -0.413963 -0.566839 -0.704644 0.267216 0.366996 0.158606 -0.526435 -0.525021 0.246321 0.247062 0.271948 0.267558 0.227595 0.235650 0.239464 0.239811 0.248044
chargesum: 0.00000
title: Mulliken charges with hydrogens summed into heavy atoms:
elementType: I O O O O C C C C C C C C C C
charge: 0.170276 -0.221927 -0.290775 -0.288107 -0.192148 0.382989 0.160323 0.079420 -0.294891 -0.704644 0.267216 0.366996 0.158606 0.204369 0.202298
polarizability: 1.89073943e+02 -8.20078083e+00 1.82438147e+02 -2.93236944e-01 1.29849037e+00 7.02873781e+01
1716.lowfreq: -7.3015 -0.0005 -0.0004 -0.0003 2.7855 8.1093 53.8253 65.1116 78.0619
frequency: 53.8234 65.1062 78.0580 95.5692 115.8588 121.8647 146.7702 149.9440 176.6549 188.7229 220.5157 243.7582 261.3383 290.7518 341.7614 382.0864 420.2951 447.2665 521.2645 556.4457 584.7561 626.9336 656.8223 705.3774 720.2907 753.6579 778.1623 804.7053 883.5583 906.0269 933.7991 953.6860 987.3829 998.5809 1076.1002 1112.4366 1114.1167 1138.2184 1140.5033 1151.4064 1163.5252 1176.2611 1280.3662 1299.5569 1354.8524 1380.6304 1411.0516 1436.0438 1447.6313 1457.9577 1459.3650 1463.3462 1470.0783 1484.8595 1556.5698 1603.5943 1705.7198 2980.3841 2985.9912 3009.9766 3066.1926 3079.8771 3090.1660 3131.1434 3135.9038 3164.7035
redmass: 4.9626 3.4359 4.1873 2.9009 5.9244 1.7704 1.6124 1.4474 4.9821 5.1092 2.9497 5.3744 6.7658 7.3759 4.8971 7.8979 6.8465 5.9468 8.2039 4.2562 7.6967 6.4051 6.9940 7.3652 8.2817 8.1533 5.9745 8.8396 1.4878 6.6179 8.4166 11.2474 5.5668 1.7652 7.2416 1.2502 1.2366 2.4325 1.0746 1.3521 2.0561 1.6647 5.3082 1.7266 4.4921 3.8338 2.4871 1.4906 1.4074 1.0726 1.1027 1.0623 1.0554 1.0531 9.4480 7.9682 12.9690 1.0299 1.0317 1.0575 1.1070 1.1056 1.1020 1.1028 1.1044 1.0932
irintensity: 0.9475 0.9143 6.7238 6.6092 4.5798 0.7033 0.9187 2.2120 4.1015 3.2886 4.7259 2.8388 7.4980 9.2896 4.4946 2.5974 2.6266 3.3665 9.5030 2.9715 11.8781 1.7405 12.9025 0.5628 6.0745 6.8135 11.3703 91.3986 15.2459 46.9184 180.7687 60.9981 14.4029 1.1884 87.0726 13.1733 1.2337 15.5734 0.1571 0.8352 8.8040 16.1826 266.2680 31.5088 100.5278 48.6635 12.4817 48.5061 20.8381 3.8141 15.2298 2.9753 6.9470 22.0155 64.6649 86.0786 319.5918 53.8194 72.0688 26.3468 9.1520 21.0235 20.4713 17.4550 14.9187 1.8118
temp: 298.150 k
press: 1.00000 atm
elementType: 53 8 8 8 8 6 6 6 6 6 6 6 6 6 6 1 1 1 1 1 1 1 1 1
symmnumber: 1
zpe: 446806.0 jmol-1
zpe.correction: 0.170179 hartree
zpe.thermalcorrener: 0.185072 hartree
zpe.thermalcorrenthalpy: 0.186016 hartree
zpe.thermalcorrgfe: 0.126587 hartree
zpe.sumelectzpe: -697.728805 hartree
zpe.sumelectthermal: -697.713912 hartree
zpe.sumelectthermalent: -697.712968 hartree
zpe.sumelectthermalfe: -697.772397 hartree
dipole: -6.9250 0.1537 0.4971
dipole: 6.9445
quadrupole: -107.4675 -89.0042 -98.1086
quadrupole: -6.6054 2.8651 -3.3057
quadrupole: -9.2741 9.1893 0.0849 -6.6054 2.8651 -3.3057
hfenergy: -697.8989843 hartree
pointgroup: C01 [X(C10H9I1O4)]
dipole: 2.3182196 1.3850784 -0.4150801 debye
dipolederiv: 0.1374541 -0.035248 0.0003845 -0.0152444 -0.4649989 0.1015155 0.0047466 0.087759 0.0411268 -0.6427328 0.3095996 -0.0671646 0.1416253 -0.9432721 0.1425289 -0.026975 0.1379684 -0.3251485 -1.6050389 -0.4363446 -0.2520264 -0.1907791 -0.4736949 -0.0568202 -0.0453503 -0.0345813 -0.3900735 -1.1107211 0.3267939 0.2323797 0.3964195 -0.5180926 -0.1911885 0.1316132 -0.1273246 -0.4073733 -0.8786264 -0.2490922 0.0608015 -0.3615728 -0.7930891 0.1114895 0.0827739 0.1074648 -0.3275852 0.2269311 -0.0234829 0.0195849 0.1372735 0.088041 -0.0305428 -0.028818 -0.0502553 -0.0486671 -0.8377613 -0.1012606 0.0162932 -0.0671918 -0.5105555 0.1052435 0.0201924 0.1071446 0.0442198 0.2261086 0.1581371 -0.0378217 0.0596904 0.2973694 0.0038174 -0.0073086 0.0223155 0.3309465 -0.4393795 0.0670206 -0.0696771 0.1168454 -0.0220746 -0.0420424 -0.1224474 -0.0646582 -0.1503101 0.1117442 0.2525114 -0.0054185 -0.0290753 1.122644 -0.282194 0.049926 -0.2697695 -0.1140899 1.2054636 0.2734405 0.1483693 0.5733514 0.5531894 0.0122694 -0.1821108 -0.0624004 0.0050017 0.5750345 -0.437624 -0.1074384 -0.898248 -0.2311777 0.1982429 0.205252 0.0749495 -0.0346699 1.7126599 -0.10207 0.0160779 0.3311919 1.4197569 -0.2664805 -0.0784811 -0.2401682 0.3001127 0.6935121 0.166629 0.1801817 -0.1459917 0.1639965 0.033652 0.3885531 0.2037554 0.4378631 0.4924108 -0.1346567 -0.1641623 -0.0690618 0.2747013 0.1217488 -0.3475933 0.2104809 0.46726 0.034004 -0.0087851 0.0193136 0.0129244 -0.0565854 -0.0576475 0.0339245 -0.1112966 0.0280038 0.0375112 -0.0068387 -0.0130701 -0.0052053 0.0213759 0.0589781 -0.0346431 0.110974 -0.0499636 0.0885825 -0.0123314 0.0069757 -0.0276943 -0.0316716 0.0328084 0.0035109 0.035207 0.1603004 0.0937589 0.0151803 -0.0081993 0.105164 -0.017514 0.0829124 -0.0486811 0.0178343 0.0513928 0.0062767 0.064529 0.0661623 0.0312102 0.0181366 -0.1097479 -0.1100993 -0.1355278 -0.0997006 -0.1219753 -0.0950994 0.013926 -0.096672 0.0808542 0.0127299 0.0418097 0.0261298 0.0598667 -0.0065865 -0.0806869 -0.1003425 -0.0274575 0.0275294 -0.083209 0.0266951 -0.099157 -0.0515888 -0.0501405 0.1108509 -0.0037855 0.1346083 0.024383 0.0068564 -0.0276474 0.0337855 0.0613842 0.0515101 -0.0211716 0.048656 -0.1061101 -0.0292509 0.0950795 0.071158 0.0193701 0.0116919 unknown
polarizability: 180.2196813|6.7635417|188.4337226|-1.3735993|-18.4253359|73.1460639 unknown
InChI: InChI=1S/C10H9IO4/c1-13-6-3-5-4-15-10(12)7(5)8(11)9(6)14-2/h3H,4H2,1-2H3
charge 0 multiplicity 1
24 atoms
I  -0.493654 -3.051813 0.655779
O  -3.396772 0.957752 -0.128616
O  2.634586 1.434542 -0.244676
O  2.205889 -1.349952 0.303876
O  -3.431006 -1.321503 0.374055
C  -1.043635 1.288189 -0.215745
C  -1.290334 -0.074344 0.081048
C  -2.37084 2.001638 -0.365753
C  0.256971 1.798829 -0.312924
C  -0.212021 -0.973018 0.254014
C  1.3393 0.912808 -0.113183
C  1.112299 -0.481805 0.137421
C  -2.763344 -0.303358 0.143594
C  3.538604 1.272154 0.924292
C  2.915569 -1.682323 -0.959362
H  -2.52264 2.802423 0.379835
H  -2.530453 2.410553 -1.379529
H  0.469633 2.851214 -0.521325
H  3.63152 0.210533 1.207293
H  3.149857 1.860988 1.775656
H  4.505608 1.679845 0.595332
H  2.228351 -2.202191 -1.651353
H  3.732161 -2.357168 -0.663708
H  3.318153 -0.767093 -1.42992
