program: Gaussian 09
title: 000240737
version: EM64L-G09RevD.01
frameworkgroup: C1[X(C11H8ClN3O)]
method: RPBEPBE
basis: SDD
operation: Freq
keyword: #p
keyword: freq=noraman
keyword: PBEPBE/SDD
title: #p freq=noraman PBEPBE/SDD
converged: YES YES NO NO
title: Mulliken charges:
elementType: Cl O N N N C C C C C C C C C C C H H H H H H H H
charge: -0.042260 -0.247924 -0.228434 0.025022 -0.009735 0.166459 0.231456 -0.293990 0.170690 -0.031448 -0.346105 -0.337786 -0.582697 -0.218852 -0.217461 -0.177849 0.268550 0.263206 0.281906 0.262746 0.295962 0.279149 0.245386 0.244009
chargesum: 0.00000
title: Mulliken charges with hydrogens summed into heavy atoms:
elementType: Cl O N N N C C C C C C C C C C C
charge: -0.042260 -0.247924 -0.228434 0.025022 -0.009735 0.166459 0.231456 0.237766 0.170690 -0.031448 -0.064199 -0.075040 -0.007587 0.026534 0.026548 -0.177849
polarizability: 2.24061812e+02 7.41010779e+00 1.76226410e+02 -1.55810259e+01 -1.23659000e+00 6.91249551e+01
1716.lowfreq: -0.0008 -0.0004 0.0011 1.6317 8.2413 11.0444 31.5727 45.4641 72.8256
frequency: 31.4772 45.4410 72.8188 92.5358 123.5619 126.7930 171.4291 213.3899 241.1598 263.5453 335.0023 347.5216 415.2598 417.9627 435.4149 474.6078 478.7246 498.4654 528.5133 638.2846 652.6189 653.8919 678.8625 707.5550 725.7926 772.1129 791.7866 793.4054 804.3428 905.0350 926.7673 986.9416 997.2272 1013.7494 1025.6684 1048.8466 1055.7762 1090.4544 1112.9850 1179.9396 1198.9352 1233.2031 1268.1570 1273.0387 1283.5745 1318.2632 1327.4446 1362.1820 1401.1599 1425.4129 1446.5858 1458.6200 1474.8057 1491.6793 1569.3299 1610.2475 1616.1779 2185.2060 3059.2957 3069.1501 3131.3850 3141.1095 3151.7685 3158.8710 3164.1614 3176.4941
redmass: 6.0953 8.6985 2.7959 7.8329 8.9383 5.3959 5.9186 10.8712 6.8449 4.2124 4.7283 5.0741 6.4775 4.5691 9.6128 5.9754 5.9275 7.6381 8.4379 7.2790 5.7711 5.2491 4.5149 6.8190 6.1528 2.0270 1.7014 2.9952 1.9927 1.4733 6.6099 1.3799 2.0914 1.3531 3.1359 2.3463 4.3606 1.7853 2.4018 1.0816 2.1930 1.7559 1.4334 2.9612 1.7195 1.7702 2.2405 1.2787 9.9779 2.6671 1.1248 1.1017 2.9251 5.0682 7.4583 8.6778 7.3284 12.6379 1.0589 1.0556 1.1077 1.0867 1.0904 1.1123 1.0953 1.1004
irintensity: 0.2722 1.0755 2.5012 5.6604 2.6367 1.3028 0.5585 2.2791 1.3661 2.4741 13.9702 8.5772 3.8869 2.8646 0.0645 1.7673 1.5735 4.2180 13.2267 26.8353 2.8013 9.9715 28.1468 48.0763 10.5581 5.8930 55.8702 6.4550 2.3564 0.0184 11.3278 2.1731 21.3390 0.1801 14.0721 4.4216 0.9884 73.6786 2.3262 2.6176 4.4794 14.2262 40.9899 54.7581 3.5737 14.2255 26.8630 3.6647 23.1601 21.4225 20.6764 14.0241 11.8638 6.3039 25.6561 205.6691 57.7389 16.6994 0.5586 16.2894 0.4823 1.5376 4.8015 2.9104 3.9413 16.2958
temp: 298.150 k
press: 1.00000 atm
elementType: 17 8 7 7 7 6 6 6 6 6 6 6 6 6 6 6 1 1 1 1 1 1 1 1
symmnumber: 1
zpe: 447833.6 jmol-1
zpe.correction: 0.170571 hartree
zpe.thermalcorrener: 0.184250 hartree
zpe.thermalcorrenthalpy: 0.185194 hartree
zpe.thermalcorrgfe: 0.128301 hartree
zpe.sumelectzpe: -1122.377082 hartree
zpe.sumelectthermal: -1122.363403 hartree
zpe.sumelectthermalent: -1122.362459 hartree
zpe.sumelectthermalfe: -1122.419352 hartree
dipole: 3.8461 -2.6636 -0.4892
dipole: 4.7039
quadrupole: -95.7862 -116.9695 -98.2200
quadrupole: -13.8700 -2.0956 1.3820
quadrupole: 7.8724 -13.3109 5.4386 -13.8700 -2.0956 1.3820
hfenergy: -1122.5476528 hartree
pointgroup: C01 [X(C11H8Cl1N3O1)]
dipole: 1.560752 -0.9794784 -0.1719999 debye
dipolederiv: -0.7384314 -0.0263062 -0.0273164 -0.0145247 -0.1508086 -0.0010831 -0.0070775 -0.000326 -0.1856253 -0.6832715 -0.2900817 0.0328435 -0.4000147 -1.0945995 0.0679383 0.0135528 0.0249745 -0.339621 -0.3954232 0.3185276 -0.0412612 -0.8551835 -0.9795707 0.0791014 -0.1325785 -0.0813238 -0.1761674 0.1951664 0.324787 -0.0209249 1.0134747 0.1470827 -0.0908946 -0.072172 -0.038654 -0.1117669 -0.2366421 -0.0772967 -0.0016467 -0.0696878 -0.3476959 -0.0009104 0.0014462 0.0124896 -0.2234633 -0.3566201 -0.1841867 0.0478833 -0.1986922 -0.0058533 0.0237224 0.0532712 0.0235699 -0.0061897 0.1543706 -0.2018818 -0.0042743 0.071008 -0.0969248 -0.0182907 -0.0037027 0.0317302 0.0604006 0.5465214 0.0258952 -0.0081173 0.0075874 0.0887638 -0.0108938 0.0364575 0.0220224 0.1506449 0.7541125 -0.0508079 -0.058643 0.4042157 1.4482107 -0.0668792 -0.0184995 0.0357348 0.2300533 -0.1474438 -0.2378374 -0.0001523 -0.2819494 0.3040961 0.031093 0.0564343 0.0388805 0.1302939 -0.1535566 0.2240006 -0.0023638 -0.0064934 0.0126631 0.0000212 -0.0024763 -0.0304077 -0.1029465 -0.1932306 0.1360033 0.001235 0.1665827 0.0387969 -0.0167128 0.0072593 -0.0166114 -0.1204723 0.8469973 0.0430597 -0.0058385 0.0558775 0.1701884 -0.0038751 0.0623433 -0.0161278 0.1258397 0.0155888 -0.2218576 -0.0166329 -0.0720038 0.035708 0.012728 -0.0191973 0.0283195 -0.1316082 0.2110491 0.0289179 -0.043705 0.0094641 0.0318755 -0.0065934 -0.0435961 -0.0043255 -0.1202052 0.0226413 0.201348 0.0028094 0.1910994 0.2531706 -0.0117891 0.0028391 -0.0352005 0.0247145 0.0376588 0.0125963 -0.0064866 -0.0483919 0.0364487 0.082842 -0.031871 0.033016 0.0513658 0.0381022 0.0036255 0.0018873 0.0427227 0.0219572 -0.0825106 -0.0147432 -0.0516695 0.0528986 0.098433 -0.0741709 0.0088642 -0.0090074 0.0284014 0.0008511 0.0082306 0.008921 0.1548433 0.0952289 -0.0253224 0.0081126 -0.0598939 -0.0155339 0.0072505 0.0079886 0.0041946 0.1568835 -0.0082726 0.0445943 0.0450829 0.0061702 0.0032651 -0.0796808 0.0391547 -0.0325394 0.0459978 -0.0306602 -0.048784 0.0398997 -0.0238899 -0.003258 0.0931894 0.0048801 0.0530352 0.0238973 0.0188308 0.0882633 0.0172566 0.0953348 -0.0195468 -0.0118127 0.0192064 -0.0111587 0.1576918 -0.091149 -0.0130857 0.0314885 -0.0238045 0.0931632 0.003189 0.0328501 0.0014561 0.1525408 unknown
polarizability: 223.8927166|9.6298831|176.9835132|-12.2823456|-0.5050132|68.5369473 unknown
InChI: InChI=1S/C11H8ClN3O/c12-5-6-15-11(16)9-4-2-1-3-8(9)10(7-13)14-15/h1-4H,5-6H2
charge 0 multiplicity 1
24 atoms
Cl -5.420508 -0.282075 -0.442639
O  -1.200742 -2.350609 0.287827
N  -1.3767 -0.01921 0.379761
N  -0.889108 1.26379 0.304871
N  1.333009 3.888927 -0.015686
C  0.832131 -1.020084 0.059767
C  1.369953 0.304407 -0.010091
C  -2.843561 -0.114581 0.586344
C  -0.616924 -1.228678 0.244079
C  0.432404 1.416085 0.115184
C  1.689154 -2.143523 -0.054773
C  2.769921 0.483351 -0.194897
C  -3.567542 -0.219073 -0.765198
C  3.069718 -1.953974 -0.234656
C  3.608164 -0.638538 -0.305131
C  0.900465 2.776523 0.047292
H  -3.046807 -1.012804 1.189845
H  -3.15952 0.789617 1.127448
H  1.245511 -3.142382 0.001028
H  3.184331 1.495651 -0.249403
H  -3.318846 -1.14822 -1.296923
H  -3.397051 0.666015 -1.395185
H  3.735048 -2.819003 -0.321366
H  4.685101 -0.499812 -0.446496
