program: Gaussian 09
title: 000240786
version: EM64L-G09RevD.01
frameworkgroup: C1[X(C19H29N5O2)]
method: RPBEPBE
basis: SDD
operation: Freq
keyword: #p
keyword: freq=noraman
keyword: PBEPBE/SDD
title: #p freq=noraman PBEPBE/SDD
converged: YES YES NO NO
title: Mulliken charges:
elementType: O O N N N N N C C C C C C C C C C C C C C C C C C C H H H H H H H H H H H H H H H H H H H H H H H H H H H H H
charge: -0.262186 -0.175797 -0.245175 -0.430223 0.020622 0.021513 0.041634 -0.374446 -0.381736 -0.346287 -0.346950 -0.534628 -0.407908 -0.334538 -0.543829 -0.356597 -0.357681 0.242145 0.104579 0.184055 0.218437 -0.693167 -0.126537 -0.697103 -0.197082 -0.379488 0.216807 0.185729 0.208606 0.224596 0.182647 0.194957 0.202893 0.195872 0.266064 0.243362 0.212519 0.216761 0.185232 0.174262 0.230123 0.239029 0.194914 0.198831 0.198252 0.197419 0.211211 0.209208 0.219197 0.381321 0.209114 0.218768 0.209744 0.273917 0.257020
chargesum: 0.00000
title: Mulliken charges with hydrogens summed into heavy atoms:
elementType: O O N N N N N C C C C C C C C C C C C C C C C C C C
charge: -0.262186 -0.175797 -0.245175 -0.048902 0.020622 0.021513 0.041634 0.028090 0.051465 0.031317 0.051815 -0.025201 0.021371 0.024956 -0.074677 0.037148 0.037991 0.242145 0.104579 0.184055 0.218437 -0.053551 -0.126537 -0.059477 0.076835 -0.122468
polarizability: 3.01614657e+02 -5.27349962e+00 2.76131196e+02 -3.34872328e+01 -1.34236094e+01 1.84094296e+02
1716.lowfreq: -13.8454 -8.0329 0.0006 0.0006 0.0008 4.9155 8.1936 12.9382 20.5279
frequency: -7.3122 7.1025 20.0061 28.5402 37.7533 45.2238 48.1612 58.0708 65.4157 85.9026 93.0575 106.7710 115.9522 121.9192 129.5856 136.8102 142.4011 162.9637 191.8733 204.5648 227.4457 229.1549 232.8475 234.5221 248.8382 291.6032 301.4679 307.9691 325.3548 348.7482 381.6282 394.2205 452.4343 465.2416 473.5510 503.9541 530.1691 546.5088 557.7931 570.0998 618.0089 636.9788 663.6754 682.1943 701.1457 722.9277 726.2245 739.1159 761.1870 769.3526 790.9446 824.0334 830.9020 838.9847 847.5609 866.1863 868.1617 872.5655 888.6501 890.0051 899.2407 916.7961 938.7935 951.5639 962.5168 1004.8978 1011.4928 1014.4806 1025.6214 1028.2733 1056.7513 1065.7301 1077.4197 1082.0384 1085.3443 1096.9253 1110.7409 1111.4875 1124.5281 1151.1731 1173.1020 1195.6813 1200.8931 1209.4210 1214.2238 1237.2493 1246.3750 1254.9440 1256.9759 1262.7048 1264.0336 1265.8506 1286.0753 1286.7583 1289.7449 1291.8959 1292.9493 1313.6355 1316.2822 1316.8086 1321.3148 1344.3070 1350.8563 1352.2499 1360.5722 1362.8200 1364.4818 1386.7683 1389.7815 1413.1868 1435.6103 1448.6696 1454.3588 1456.9475 1460.5495 1464.4823 1466.1511 1469.6167 1474.5830 1477.0177 1477.2654 1478.7594 1483.0255 1486.6893 1488.1794 1497.8567 1526.1959 1556.9927 1616.0242 1661.4509 2944.2694 2953.8696 2958.6934 2964.2457 2967.7283 2969.2801 2970.2632 2971.1851 2973.5162 2975.8091 2985.7980 2990.7984 2992.2307 2995.4750 3009.2657 3011.9396 3023.5669 3029.8392 3034.8378 3041.8514 3061.1981 3064.9937 3069.5830 3071.2698 3073.4247 3080.4031 3172.4730 3249.7236 3286.0933
redmass: 1.8214 4.0794 5.0129 3.7873 4.0556 2.2348 2.8908 4.4034 3.7318 3.3573 3.6775 3.1333 3.0642 3.3828 1.8861 3.1227 3.1624 4.0806 4.9645 2.9138 3.7276 1.5311 1.2429 1.8943 5.9223 2.9764 4.1284 4.8183 3.1488 3.5841 3.6048 3.0580 8.4197 3.1373 2.9908 5.3994 3.3603 6.2428 4.1953 5.8722 4.3512 4.4873 3.1959 6.9756 2.2465 1.1127 1.1272 1.7627 1.3995 1.9092 4.2580 2.6265 1.8424 1.4833 2.4879 2.4853 2.1269 2.8060 1.8674 1.9280 1.1794 3.6160 1.4508 1.4677 1.3474 1.8988 3.1170 2.4955 4.0535 3.6256 3.8108 2.3826 2.4317 1.7826 2.3279 2.1696 2.1256 2.0875 1.9985 5.1315 2.0440 1.4948 1.4538 1.5199 1.7191 2.5854 3.1518 1.3495 1.4112 1.3686 3.3688 1.5085 1.0506 1.0881 1.1804 3.6866 1.1804 1.4441 1.3590 1.7241 1.2607 2.2066 1.5583 1.5760 1.5952 1.8713 1.6022 1.2168 1.2160 2.2152 1.1188 2.4897 1.1233 1.1924 1.0684 1.0750 1.0825 1.0784 1.0709 1.0448 1.0500 1.0716 1.1298 1.1027 1.1278 3.0580 9.4431 3.2080 6.7315 4.1880 1.0591 1.0591 1.0606 1.0597 1.0593 1.0439 1.0526 1.0616 1.0363 1.0598 1.0967 1.0646 1.0822 1.0767 1.1002 1.0985 1.1029 1.1002 1.1003 1.1040 1.1022 1.1005 1.1006 1.0994 1.0993 1.0976 1.0925 1.0979 1.0809
irintensity: 0.0871 0.7796 0.1210 0.3099 0.1547 0.0846 0.3711 1.9365 0.0744 0.2614 1.3584 0.8775 2.1706 0.9853 0.0214 1.9872 0.6064 1.4887 2.0165 0.2807 1.4403 0.2493 0.0659 0.6631 0.3089 1.9297 2.0856 2.4370 7.1418 0.2787 4.0564 0.5637 3.3111 5.2388 3.3222 7.6677 2.5667 22.4986 3.7083 10.6249 8.7915 4.7927 0.7340 2.7218 1.8871 8.3662 18.6862 1.2574 5.7908 0.4264 0.3298 6.9197 21.5092 11.7451 6.7560 10.1277 5.8613 14.3939 5.7086 10.9703 96.6439 58.4443 9.2323 12.9585 5.8881 5.6391 23.2386 11.3103 2.9548 13.7222 30.1420 27.2531 1.0704 7.4580 6.9244 35.2751 10.2390 3.5871 21.0114 78.1594 43.9648 2.3595 1.5609 6.8868 32.7633 195.3550 89.5321 5.5260 19.9802 12.6501 39.4722 31.9538 0.0918 2.1941 5.2810 54.9693 6.5214 4.2577 1.8095 40.5930 1.5149 42.3930 0.6129 2.2696 17.6600 103.2348 15.6202 13.7728 8.9267 156.5237 48.4697 126.5790 19.6097 5.5083 0.1560 0.2781 2.1980 2.6210 0.5909 21.6600 6.8712 1.6756 8.2541 8.3072 21.3156 32.7356 305.5653 713.8047 112.0163 67.4211 25.1614 3.8325 6.3208 0.4412 93.8105 39.5418 13.3374 40.4313 35.2647 71.6451 5.7666 30.6105 6.1178 33.2747 1.5009 3.4058 4.2594 23.8249 39.8387 89.6335 35.8514 113.1113 77.7425 72.5200 36.1565 32.1467 16.3983 0.5541 257.9446
temp: 298.150 k
press: 1.00000 atm
elementType: 8 8 7 7 7 7 7 6 6 6 6 6 6 6 6 6 6 6 6 6 6 6 6 6 6 6 1 1 1 1 1 1 1 1 1 1 1 1 1 1 1 1 1 1 1 1 1 1 1 1 1 1 1 1 1
symmnumber: 1
zpe: 1209880.6 jmol-1
zpe.correction: 0.460819 hartree
zpe.thermalcorrener: 0.487746 hartree
zpe.thermalcorrenthalpy: 0.488690 hartree
zpe.thermalcorrgfe: 0.399414 hartree
zpe.sumelectzpe: -1163.659034 hartree
zpe.sumelectthermal: -1163.632107 hartree
zpe.sumelectthermalent: -1163.631163 hartree
zpe.sumelectthermalfe: -1163.720439 hartree
dipole: 7.0706 -5.2368 -2.4720
dipole: 9.1394
quadrupole: -188.6059 -157.4656 -158.8232
quadrupole: 3.1373 9.8787 2.6512
quadrupole: -20.3076 10.8326 9.4750 3.1373 9.8787 2.6512
hfenergy: -1164.1198532 hartree
pointgroup: C01 [X(C19H29N5O2)]
dipole: -1.4484529 3.2677878 -0.3906936 debye
polarizability: 290.5483674|-20.1367099|284.4817949|33.8924394|14.4006719|186.8099875 unknown
InChI: InChI=1S/C19H29N5O2/c1-3-5-7-9-11-15(25)23-19-17-18(20-13-21-19)22-14-24(17)16(26)12-10-8-6-4-2/h13-14,23H,3-12H2,1-2H3
charge 0 multiplicity 1
55 atoms
O  0.473802 0.865573 -1.116491
O  -0.049909 -4.118919 -1.208917
N  2.363194 0.574863 0.216809
N  0.727472 -1.877683 -1.161506
N  4.343461 0.14916 1.328798
N  2.548245 -3.192579 -0.349906
N  4.422606 -2.281829 0.937491
C  -1.20121 3.164748 0.550621
C  -0.0039 3.56082 -0.343461
C  -2.494452 3.92771 0.185876
C  -2.925943 -1.909635 -0.482611
C  1.313661 2.852486 0.040563
C  -2.248003 -1.37724 -1.765115
C  -3.907105 -0.890319 0.13818
C  -1.303055 -2.408231 -2.444529
C  -3.696923 3.544075 1.078329
C  -4.581108 -1.397902 1.433656
C  1.325521 1.373003 -0.335053
C  2.599903 -0.836783 0.093163
C  -0.162455 -2.918518 -1.552827
C  1.936367 -1.975298 -0.476096
C  -4.986529 4.310073 0.71344
C  3.829323 -1.066301 0.793489
C  -5.575834 -0.381294 2.034741
C  3.468396 1.076191 0.978247
C  3.72481 -3.286204 0.332167
H  -1.385539 2.075481 0.462388
H  -0.949896 3.362726 1.614144
H  0.161724 4.653525 -0.268437
H  -0.243431 3.340951 -1.400491
H  -2.31403 5.020407 0.266204
H  -2.749815 3.730628 -0.87601
H  -2.152436 -2.179125 0.265392
H  -3.466321 -2.849894 -0.715507
H  2.169883 3.335854 -0.474566
H  1.495999 2.963762 1.126822
H  -3.028714 -1.100276 -2.501728
H  -1.702461 -0.439665 -1.535705
H  -4.691506 -0.634064 -0.605008
H  -3.365434 0.055993 0.354758
H  -0.869197 -1.960739 -3.361238
H  -1.878329 -3.300899 -2.743751
H  -3.43918 3.735262 2.14022
H  -3.878654 2.45301 0.993312
H  -3.798428 -1.640034 2.181022
H  -5.108221 -2.349729 1.21922
H  -5.281571 4.113162 -0.334446
H  -4.84497 5.402004 0.822404
H  -5.830139 4.012582 1.362731
H  0.429082 -0.904866 -1.356467
H  -5.069428 0.57088 2.284769
H  -6.040511 -0.76865 2.959967
H  -6.38792 -0.150829 1.319327
H  3.564717 2.132043 1.215991
H  4.15719 -4.28877 0.396028
