program: Gaussian 09
title: 000240769
version: EM64L-G09RevD.01
frameworkgroup: C1[X(C20H31FO2)]
method: RPBEPBE
basis: SDD
operation: Freq
keyword: #p
keyword: freq=noraman
keyword: PBEPBE/SDD
title: #p freq=noraman PBEPBE/SDD
converged: YES YES NO NO
title: Mulliken charges:
elementType: F O O C C C C C C C C C C C C C C C C C C C C H H H H H H H H H H H H H H H H H H H H H H H H H H H H H H H
charge: -0.245678 -0.460040 -0.188172 -0.173460 0.413348 -0.104546 -0.155053 0.321879 0.205149 -0.546962 -0.524682 -0.557558 -0.524250 -0.122675 -0.479916 -0.470938 -0.819653 -0.592410 -0.609885 -0.812041 -0.146571 0.135972 -0.726971 0.208893 0.272820 0.207644 0.204972 0.226481 0.250148 0.196194 0.215971 0.228992 0.229105 0.208148 0.237728 0.234718 0.197107 0.202020 0.235842 0.224220 0.255479 0.222272 0.235166 0.242948 0.255548 0.244479 0.246882 0.210322 0.225671 0.249039 0.329984 0.224967 0.217651 0.243701
chargesum: 0.00000
title: Mulliken charges with hydrogens summed into heavy atoms:
elementType: F O O C C C C C C C C C C C C C C C C C C C C
charge: -0.245678 -0.130056 -0.188172 0.035433 0.413348 0.168274 0.052591 0.321879 0.205149 -0.115509 -0.078340 -0.112594 -0.086997 0.115054 -0.048092 -0.033075 -0.117682 -0.114297 -0.109857 -0.129166 0.102468 0.135972 -0.040653
polarizability: 2.47176222e+02 -1.36108684e+00 1.96755730e+02 -2.58290549e+00 -2.61537813e+00 1.77380779e+02
1716.lowfreq: -19.7232 -8.4612 -0.0009 -0.0007 -0.0003 7.7811 34.3537 48.3109 70.2534
frequency: 34.1131 47.7519 70.2168 87.0083 102.8494 125.5998 151.2184 170.7966 180.4999 182.1773 215.5460 218.5961 228.2155 241.2377 258.5292 267.2544 275.9118 282.7921 289.5697 303.5271 322.8371 331.0038 343.9744 370.3080 374.1762 381.9354 388.5793 400.8979 428.6773 443.3126 463.6454 477.6895 501.0906 515.0873 536.7927 552.2989 560.6819 591.5712 611.1890 630.9705 679.5682 697.4709 731.7909 762.8396 788.0882 807.1794 830.9007 838.3001 847.1790 856.2454 891.3433 897.6140 907.3255 915.5396 919.5291 933.2884 946.8916 956.4427 971.7125 987.0413 991.0944 1001.5194 1004.1446 1018.9870 1033.3846 1042.9642 1057.7469 1064.9282 1070.6439 1085.6300 1094.0369 1112.8085 1126.6976 1129.4267 1136.7920 1142.8229 1144.4743 1164.2963 1176.1682 1181.1380 1195.0157 1198.3089 1218.5590 1223.4153 1234.2210 1239.0478 1246.5263 1254.5292 1260.4435 1263.6627 1270.9530 1290.5402 1292.5145 1298.6972 1301.8518 1313.9985 1317.6081 1319.8708 1325.7081 1329.1986 1336.0411 1339.7237 1345.6237 1350.1657 1355.3278 1367.7479 1369.3612 1386.7477 1387.9577 1396.8126 1442.3498 1459.2881 1464.3665 1466.2569 1467.4822 1471.4294 1472.3010 1472.5983 1476.3429 1478.6053 1481.6184 1482.6602 1488.8761 1495.7966 1626.1432 2918.3604 2941.9444 2955.0473 2965.8666 2970.1320 2972.0945 2982.1028 2986.6754 2989.5956 2990.5338 2993.4666 2994.7055 2999.2712 3001.3784 3004.5072 3016.0973 3027.0336 3027.8464 3043.3142 3044.4264 3051.5833 3055.5714 3066.1202 3067.3454 3068.1553 3081.5851 3087.6489 3089.4233 3089.5964 3102.9873 3555.3485
redmass: 6.1910 3.7671 4.3517 3.3171 2.2555 3.3143 3.3016 1.9579 1.2998 2.9040 2.9621 1.6970 2.4161 2.9939 1.8431 2.7516 1.6211 2.4836 1.1235 2.7333 2.6418 2.5217 2.5487 3.2254 2.3739 3.2353 3.2368 4.1160 3.5748 2.7372 3.0819 3.0885 3.4632 3.0906 2.5334 2.9253 3.5344 2.7598 3.7474 3.1291 4.2747 2.7991 2.9285 2.9820 1.6118 2.3173 1.8922 2.1987 2.1350 2.2972 2.2085 2.0189 2.2082 2.4471 1.6792 1.8216 1.8085 2.6265 1.8608 2.7404 1.7551 2.0762 1.8152 1.9710 1.6815 1.8448 1.6548 1.6640 1.8950 2.4571 2.4093 2.6485 2.1561 1.8631 1.7318 2.3132 1.9493 1.8192 1.9778 1.6688 2.0603 1.5579 1.7245 1.6477 1.3703 1.6852 2.0765 1.5422 1.6159 1.3471 1.5123 1.3704 1.3805 1.3948 1.3673 1.3347 1.5082 1.4200 1.4527 1.3901 1.4976 1.4989 1.5518 1.5606 1.5268 1.4838 1.4536 1.2088 1.2256 1.1947 1.0831 1.0705 1.0828 1.0771 1.0581 1.0650 1.0635 1.0770 1.0692 1.0653 1.0733 1.0745 1.0758 1.0652 9.5835 1.0803 1.0788 1.0649 1.0595 1.0392 1.0721 1.0628 1.0361 1.0704 1.0618 1.0606 1.0777 1.0681 1.0497 1.0557 1.0803 1.0961 1.0987 1.1016 1.1018 1.1007 1.0965 1.0963 1.0973 1.1039 1.0994 1.0993 1.0980 1.0993 1.0993 1.0658
irintensity: 1.7519 1.4428 1.9051 0.4763 0.4745 2.1186 0.2113 0.7734 0.7167 1.0197 0.4397 2.3479 1.9723 0.5158 1.3308 2.1446 33.0330 1.2555 78.9171 9.6513 5.5857 1.9407 2.1632 6.4156 4.3009 3.7668 2.6660 1.6698 0.8503 3.4124 4.0421 1.2903 4.9546 4.9603 1.6055 3.2663 0.5374 3.5931 1.5462 0.1286 5.9683 5.0101 8.4368 4.5481 2.5872 2.4789 1.1537 8.6935 21.6256 4.5438 16.5181 6.3317 20.2999 8.7382 1.7086 10.7505 2.8520 13.3063 2.6930 8.4681 16.3821 2.5274 6.1262 0.1718 9.5490 60.7533 15.0325 10.3538 5.0713 24.1020 4.1613 10.6037 4.1894 12.9197 2.5773 2.3874 17.8879 7.4038 14.5971 2.7197 1.1428 2.1978 2.8123 0.5598 8.0712 3.4430 38.1245 1.1115 13.6503 6.6570 16.5881 8.3474 8.0524 1.5792 1.7530 2.3124 8.0888 4.5048 5.9314 1.4640 3.0901 2.8607 7.2045 2.0262 0.9220 1.7113 9.9278 4.1205 28.2057 27.5754 17.6674 3.7478 11.6728 3.2383 5.1978 12.7333 24.0882 1.9706 3.2350 15.7453 18.3787 10.2623 7.2838 4.7328 188.2030 17.7499 19.9421 23.7215 20.6313 37.4157 6.8583 16.5855 12.4038 85.2183 7.2096 33.3012 12.5105 14.1745 43.2167 26.4383 28.3783 56.1380 18.2490 36.5363 10.2014 30.5755 65.8889 24.4257 16.0211 52.4332 23.3930 30.0572 23.9046 44.7804 17.9238 2.4717
temp: 298.150 k
press: 1.00000 atm
elementType: 9 8 8 6 6 6 6 6 6 6 6 6 6 6 6 6 6 6 6 6 6 6 6 1 1 1 1 1 1 1 1 1 1 1 1 1 1 1 1 1 1 1 1 1 1 1 1 1 1 1 1 1 1 1
symmnumber: 1
zpe: 1240062.0 jmol-1
zpe.correction: 0.472315 hartree
zpe.thermalcorrener: 0.494597 hartree
zpe.thermalcorrenthalpy: 0.495541 hartree
zpe.thermalcorrgfe: 0.423669 hartree
zpe.sumelectzpe: -1029.224150 hartree
zpe.sumelectthermal: -1029.201868 hartree
zpe.sumelectthermalent: -1029.200923 hartree
zpe.sumelectthermalfe: -1029.272796 hartree
dipole: -3.0661 -0.2177 -2.0512
dipole: 3.6953
quadrupole: -158.3115 -135.2580 -146.4802
quadrupole: -1.6277 15.1419 -0.8612
quadrupole: -11.6283 11.4252 0.2031 -1.6277 15.1419 -0.8612
hfenergy: -1029.6964645 hartree
pointgroup: C01 [X(C20H31F1O2)]
dipole: 1.2032693 -0.0636712 0.8135096 debye
polarizability: 247.1935597|1.3104469|196.881786|-2.3563799|2.1032229|177.2373853 unknown
InChI: InChI=1S/C20H31FO2/c1-12-11-20(21)13(10-17(12)22)4-5-14-15-7-9-19(3,23)18(15,2)8-6-16(14)20/h12-16,23H,4-11H2,1-3H3
charge 0 multiplicity 1
54 atoms
F  -1.407039 0.594138 -2.355765
O  4.963582 -1.117784 -0.337202
O  -5.28246 -0.308807 1.338302
C  1.815591 0.682638 0.473171
C  2.586175 -0.424448 -0.311526
C  0.481544 1.071982 -0.190898
C  -0.419659 -0.205783 -0.288281
C  -1.772538 0.135357 -0.971054
C  3.920795 -0.498756 0.517432
C  1.705389 -1.695779 -0.341766
C  0.309662 -1.404735 -0.959907
C  2.876726 1.790065 0.715716
C  -0.256851 2.194047 0.574472
C  -2.508486 1.336445 -0.322475
C  4.233898 1.01405 0.818335
C  -1.581173 2.561351 -0.128382
C  2.934825 0.00715 -1.764576
C  -2.765122 -1.021878 -1.217222
C  -3.188157 0.899107 1.008075
C  3.829053 -1.323215 1.820205
C  -3.59396 -1.480822 0.018839
C  -4.130374 -0.289405 0.827952
C  -2.843905 -2.45448 0.974641
H  1.553405 0.252133 1.467219
H  0.676466 1.438806 -1.218298
H  -0.647843 -0.500412 0.760489
H  1.55784 -2.07424 0.690289
H  2.204098 -2.501682 -0.914332
H  0.400322 -1.207046 -2.043655
H  -0.30613 -2.31881 -0.858598
H  2.661578 2.374852 1.62769
H  2.891917 2.502729 -0.130605
H  0.387675 3.091384 0.637188
H  -0.443885 1.870189 1.620588
H  -3.315315 1.62408 -1.027908
H  4.956403 1.37854 0.065884
H  4.700432 1.134795 1.814018
H  -2.123507 3.343185 0.438934
H  -1.350171 2.986703 -1.123874
H  3.52518 0.93952 -1.790916
H  3.54664 -0.775933 -2.241245
H  2.030795 0.166273 -2.37519
H  -2.246818 -1.890074 -1.659688
H  -3.467827 -0.651206 -1.988339
H  -3.763772 1.737012 1.438606
H  -2.416487 0.619207 1.753894
H  3.651567 -2.389985 1.599501
H  4.780127 -1.244105 2.383253
H  3.026333 -0.963155 2.4885
H  -4.483397 -2.025434 -0.351606
H  5.787745 -1.219317 0.203387
H  -2.495561 -3.338849 0.410633
H  -1.963907 -1.991272 1.454249
H  -3.524215 -2.802526 1.771842
