program: Gaussian 09
title: 000240734
version: EM64L-G09RevD.01
frameworkgroup: C1[X(C8H8ClNO3)]
method: RPBEPBE
basis: SDD
operation: Freq
keyword: #p
keyword: freq=noraman
keyword: PBEPBE/SDD
title: #p freq=noraman PBEPBE/SDD
converged: YES YES NO NO
title: Mulliken charges:
elementType: Cl O O O N C C C C C C C C H H H H H H H H
charge: 0.024661 -0.257359 -0.196646 -0.174011 0.005216 0.393793 -0.493036 0.550415 -0.357311 -0.248873 -0.334698 -0.171209 -0.679321 0.304023 0.260560 0.214180 0.213452 0.260765 0.212301 0.236279 0.236819
chargesum: 0.00000
title: Mulliken charges with hydrogens summed into heavy atoms:
elementType: Cl O O O N C C C C C C C C
charge: 0.024661 -0.257359 -0.196646 -0.174011 0.005216 0.393793 -0.189012 0.550415 -0.096752 0.178759 -0.334698 0.089556 0.006079
polarizability: 1.78942407e+02 -2.94955312e+00 1.23263584e+02 3.62899883e+00 -2.93645892e+00 5.78146680e+01
1716.lowfreq: -0.0032 -0.0026 -0.0023 2.1085 5.6038 9.6011 42.0359 54.7278 94.8572
frequency: 42.0239 54.7060 94.8300 115.3640 124.2682 170.6852 190.1891 241.2238 261.9961 284.6064 316.9400 345.2752 388.4747 427.9868 461.9134 519.8306 591.1319 637.6919 664.0866 678.1528 722.0349 743.2584 808.8506 831.0842 834.6170 902.0178 941.1946 943.0736 1012.0749 1036.5975 1103.2257 1117.8306 1135.2389 1156.0689 1209.3370 1221.1017 1257.8285 1267.0145 1356.2959 1373.3342 1381.5038 1403.4087 1416.7078 1461.3574 1463.1531 1478.5604 1490.0638 1566.3912 1611.0823 2960.8493 3001.2074 3021.6119 3098.6801 3111.0500 3162.7247 3183.0743 3188.3442
redmass: 12.9272 4.8757 2.7097 4.3209 2.7190 4.8269 14.3788 1.2359 6.2188 5.4129 7.3270 10.0047 4.6516 4.0147 6.2132 4.6792 5.5518 5.9910 7.5064 4.1829 6.2354 8.2955 1.3343 4.4310 1.1339 1.5806 1.3674 3.2131 4.9273 3.1276 2.0436 2.1955 1.4337 1.4137 7.7267 3.3303 1.6944 1.1402 2.6493 1.7661 7.3338 1.2692 5.1687 1.0397 2.3872 1.1046 1.1293 7.9821 6.8631 1.0554 1.0364 1.1079 1.0989 1.1015 1.0885 1.0958 1.0923
irintensity: 0.3484 0.2012 1.9098 0.0123 0.0544 2.7291 0.8542 0.8843 1.3008 3.8358 3.1993 0.4796 0.0344 0.7398 3.2169 13.1291 5.2272 24.4199 13.1516 2.3612 4.4217 22.6274 44.9288 29.2381 0.4247 29.5527 2.3544 17.5195 39.3857 65.9238 31.0846 7.1051 5.0742 2.5565 114.8819 281.8802 143.5957 0.0465 6.4555 29.7307 77.5674 35.7415 10.7921 12.9501 244.1842 10.5357 3.4190 19.6251 36.6774 35.1733 20.1290 32.7463 24.7235 30.4166 3.4257 4.5200 7.9710
temp: 298.150 k
press: 1.00000 atm
elementType: 17 8 8 8 7 6 6 6 6 6 6 6 6 1 1 1 1 1 1 1 1
symmnumber: 1
zpe: 392274.8 jmol-1
zpe.correction: 0.149410 hartree
zpe.thermalcorrener: 0.161883 hartree
zpe.thermalcorrenthalpy: 0.162827 hartree
zpe.thermalcorrgfe: 0.109338 hartree
zpe.sumelectzpe: -1049.068271 hartree
zpe.sumelectthermal: -1049.055798 hartree
zpe.sumelectthermalent: -1049.054854 hartree
zpe.sumelectthermalfe: -1049.108343 hartree
dipole: -6.5442 -4.1871 -0.0483
dipole: 7.7692
quadrupole: -78.9936 -84.1582 -83.7757
quadrupole: -1.2138 -1.7293 1.3673
quadrupole: 3.3156 -1.8490 -1.4665 -1.2138 -1.7293 1.3673
hfenergy: -1049.2176809 hartree
pointgroup: C01 [X(C8H8Cl1N1O3)]
dipole: -2.7324322 -1.3624116 -0.144024 debye
dipolederiv: -0.5273434 0.2991895 0.0021052 0.2953738 -0.2232359 0.0175019 0.0227797 -0.0030785 -0.0023642 -1.996295 0.275738 -0.0986669 0.3931544 -0.3501053 0.0198848 -0.0996003 0.0119751 -0.2858374 -0.4448178 -0.1112344 -0.0740665 -0.0982606 -0.7706294 0.2365633 -0.0885939 0.1734421 -0.3613933 -0.6858248 -0.0682149 -0.2432004 -0.1060358 -0.3905036 0.08178 -0.1795982 0.1261603 -0.3596002 1.171408 0.4739507 0.3769014 0.4125154 1.1932521 -0.3658934 0.2932457 -0.3035621 0.520344 1.5289131 -0.4910057 0.089994 -0.8025227 0.0506968 -0.0404191 0.1076804 -0.0173023 0.1170521 -0.3262437 0.3548344 -0.025605 -0.1293134 -0.0581791 -0.0209359 0.0530383 0.0562215 -0.1224817 -0.2799212 -0.3247102 -0.0589228 -0.2893198 -0.1181082 0.0347334 -0.0154437 -0.0061198 0.0603929 -0.1360289 -0.0415642 0.0022868 0.3449124 -0.0217371 0.0163979 -0.007748 0.0017211 -0.1873595 1.1396168 -0.0126601 0.0421368 0.3702906 0.245628 0.0238937 0.0308558 0.0004279 0.395429 0.7240853 -0.582321 -0.0023881 -0.1590576 0.2396739 0.0183968 -0.0798503 -0.0452397 -0.103644 -0.2097712 0.1955311 0.0010272 -0.0257263 0.0836955 -0.0077149 0.0069383 0.0094214 -0.0656823 -0.1280811 0.083257 -0.0112671 0.0480584 0.0214415 0.0029582 -0.0105709 0.0052963 0.0488289 0.1243797 0.0060578 0.0042074 0.0243191 0.0783048 -0.0009954 -0.0328688 0.0000844 0.1753248 -0.0264975 -0.072278 -0.0074718 -0.0870887 0.0656105 -0.0041109 -0.0135166 -0.0053618 0.1653849 -0.0574702 0.0534069 0.0371125 -0.0924033 -0.0396251 -0.1130505 -0.0025434 -0.113471 -0.0769223 -0.0537879 0.040821 -0.0368608 -0.1030833 -0.0314303 0.1002363 0.008671 0.1168309 -0.0878485 0.0788474 0.0252632 -0.0041942 0.013661 -0.028214 0.0022141 0.0015807 -0.0007936 0.1582693 -0.1254664 -0.0725124 -0.0120826 -0.1090208 0.0209693 -0.0042905 -0.0108979 -0.0020765 0.1179268 0.1161704 -0.0103793 -0.0179058 0.0550909 0.0125176 -0.0970839 0.0114493 -0.1108783 -0.0511751 0.1141283 -0.0211696 0.0368605 0.0444566 0.0199781 0.099934 0.0049928 0.1063025 -0.0546442 unknown
polarizability: 176.7619362|-8.3205995|124.2266723|11.0285083|-6.0936303|59.0320507 unknown
InChI: InChI=1S/C8H8ClNO3/c1-2-13-6-3-4-7(9)8(5-6)10(11)12/h3-5H,2H2,1H3
charge 0 multiplicity 1
21 atoms
Cl 2.987274 -2.010893 0.117452
O  -2.431494 0.64313 -0.177354
O  2.199168 2.324602 -0.472801
O  3.398837 0.846649 0.783522
N  2.351474 1.185456 0.118494
C  -1.212543 -0.027394 -0.09569
C  -0.067615 0.799837 -0.057243
C  1.215041 0.227512 0.044904
C  -1.059292 -1.438014 -0.051851
C  -3.671448 -0.166921 -0.229119
C  1.380267 -1.182055 0.082489
C  0.233328 -1.99706 0.024532
C  -4.834468 0.816401 -0.307767
H  -0.172522 1.886303 -0.106183
H  -1.923432 -2.106395 -0.083546
H  -3.637666 -0.827245 -1.119647
H  -3.733657 -0.795514 0.682656
H  0.35563 -3.083962 0.037021
H  -5.791635 0.265889 -0.349256
H  -4.848288 1.475925 0.576195
H  -4.753655 1.44555 -1.210108
