program: Gaussian 09
title: 000240731
version: EM64L-G09RevD.01
frameworkgroup: C1[X(C5H12N2O2)]
method: RPBEPBE
basis: SDD
operation: Freq
keyword: #p
keyword: freq=noraman
keyword: PBEPBE/SDD
title: #p freq=noraman PBEPBE/SDD
converged: YES YES NO NO
title: Mulliken charges:
elementType: O O N N C C C C C H H H H H H H H H H H H
charge: -0.309274 -0.297102 -0.370107 -0.576930 -0.356359 -0.362043 -0.254780 0.298126 -0.663363 0.237138 0.235531 0.198801 0.214580 0.319204 0.234757 0.217339 0.279958 0.270058 0.212580 0.222166 0.249722
chargesum: 0.00000
title: Mulliken charges with hydrogens summed into heavy atoms:
elementType: O O N N C C C C C
charge: -0.309274 -0.297102 -0.050903 -0.026914 0.116310 0.051339 0.197315 0.298126 0.021104
polarizability: 1.01832457e+02 2.28115611e+00 6.17748445e+01 3.42425797e-01 4.17331638e+00 6.50764572e+01
1716.lowfreq: -9.4986 0.0005 0.0007 0.0011 7.0102 8.4582 35.4982 54.7787 66.0720
frequency: 35.3237 54.6983 66.0440 94.7082 108.1611 194.4622 213.7570 252.0546 303.8562 317.6810 324.0162 425.9574 552.1744 563.3040 602.1875 629.1619 699.6901 770.6732 802.9614 836.1096 908.4649 953.0315 1019.3306 1063.3437 1095.5566 1102.0606 1112.5735 1155.0179 1169.9515 1211.9191 1261.0770 1283.0418 1300.1138 1345.1016 1358.6300 1384.3802 1388.9339 1453.3509 1455.6049 1462.3405 1482.9651 1486.5782 1490.8826 1643.4215 1667.2155 2912.2501 2989.9822 3016.5743 3025.1540 3025.6928 3084.5566 3085.8043 3088.3163 3114.6830 3471.9881 3573.8308 3599.3893
redmass: 3.2299 3.0453 3.7202 2.2934 4.6527 1.4644 1.1119 1.6260 3.0133 4.1497 3.3836 3.3986 1.4693 2.0137 1.3291 4.1883 11.8348 1.3465 1.1755 2.4706 2.8384 1.8552 3.0532 2.3766 2.1552 3.6726 3.9611 1.6492 1.6017 2.2266 1.2764 1.1097 1.0917 1.2633 1.2396 1.3805 1.2380 1.0920 1.1013 1.0458 1.1396 1.0958 1.5912 1.1028 8.0520 1.0693 1.0360 1.0610 1.0594 1.0901 1.0980 1.1061 1.1030 1.1054 1.0453 1.0773 1.0980
irintensity: 1.5008 3.7795 5.0914 3.2192 1.3271 8.5441 51.7323 3.8414 8.7636 7.4880 23.9359 9.2139 62.2581 90.1201 241.6997 8.6877 24.2152 13.6483 2.8484 0.3537 40.8216 2.7251 71.9287 24.0121 30.7076 16.5198 143.3092 37.6280 14.1518 204.8054 26.8375 4.9098 0.6311 6.2208 1.1264 5.4421 27.5683 27.5532 4.6643 9.9599 34.4136 23.2128 264.0318 53.4643 244.4443 80.5436 21.5607 37.0520 36.7607 32.0717 37.8214 22.7699 5.0611 37.9041 0.1788 32.8532 1.3527
temp: 298.150 k
press: 1.00000 atm
elementType: 8 8 7 7 6 6 6 6 6 1 1 1 1 1 1 1 1 1 1 1 1
symmnumber: 1
zpe: 467082.5 jmol-1
zpe.correction: 0.177902 hartree
zpe.thermalcorrener: 0.189190 hartree
zpe.thermalcorrenthalpy: 0.190134 hartree
zpe.thermalcorrgfe: 0.139690 hartree
zpe.sumelectzpe: -456.941487 hartree
zpe.sumelectthermal: -456.930199 hartree
zpe.sumelectthermalent: -456.929255 hartree
zpe.sumelectthermalfe: -456.979699 hartree
dipole: -0.3279 0.2162 -2.0064
dipole: 2.0445
quadrupole: -45.9144 -53.5520 -56.0653
quadrupole: -4.1009 1.1172 -0.2116
quadrupole: 5.9295 -1.7081 -4.2214 -4.1009 1.1172 -0.2116
hfenergy: -457.119389 hartree
pointgroup: C01 [X(C5H12N2O2)]
dipole: -0.0954658 -0.7762324 -0.1879527 debye
dipolederiv: -1.7503945 0.1305224 0.0765886 0.3336113 -0.481887 0.0823919 -0.1194166 0.0787716 -0.4312687 -0.7451303 -0.0072364 0.0206722 -0.0720412 -0.8821046 0.2452957 0.0412055 0.287065 -0.4872842 -1.3289409 -0.25902 0.0542048 -0.3839452 -0.4575228 -0.0369467 0.1544629 0.0116558 -0.553704 -0.8472204 0.0625031 0.0942426 0.1018159 -0.2368805 0.0275415 0.1003035 0.0175295 -0.6236904 0.6423802 0.0404165 0.0585989 -0.2198485 0.1332328 0.041714 0.0797633 -0.0031991 0.2389415 0.5902019 -0.0609623 -0.0188988 -0.0626791 0.2292503 -0.0978728 0.0943418 -0.0670121 0.2594426 0.9046484 -0.0012668 -0.1226429 0.2059449 0.249626 0.0195373 -0.2163826 0.0049323 0.3982622 2.3229029 0.1253935 -0.1337377 0.0591559 1.1840459 -0.3994131 -0.050615 -0.4889459 0.510315 -0.0727155 0.0185597 0.0368705 -0.0321845 0.0488496 -0.0583506 0.0883086 -0.0302351 -0.1642412 0.0668545 -0.033003 -0.0143764 0.0526104 -0.0817622 -0.0146693 -0.0542939 0.0239195 0.081862 -0.0620934 -0.020211 0.0900121 -0.0238996 0.0957808 0.0416546 0.0718467 0.0248529 -0.0864499 0.0277255 -0.0152851 -0.0187761 0.0020689 -0.1855431 0.0080231 0.0010818 0.0358955 0.0666337 -0.1898188 0.0307278 0.1269675 -0.0153993 0.047016 0.0325147 0.1301164 -0.0013859 -0.1120351 0.1302179 0.0024478 -0.0052227 0.052108 0.185618 0.0826967 -0.0028565 0.0604655 0.3283294 0.0384996 0.0398452 0.0355029 -0.0800934 -0.0998501 -0.0554737 0.0684826 -0.024047 0.0497398 -0.0921399 0.0262489 -0.072587 0.0535494 0.0797817 0.0695505 -0.080617 0.0388574 -0.0662121 0.1808357 0.0112088 -0.1109938 0.0218082 0.1449306 -0.0693465 -0.2389764 -0.1023729 0.1668805 0.1856827 -0.0529995 -0.048387 0.0069015 0.0370819 0.0724974 -0.0712873 0.1119693 0.2855882 -0.1507081 -0.0838657 0.0718012 -0.090878 0.0733109 0.0122559 0.0898383 0.0016844 0.0780548 0.1187271 -0.0057517 0.0021461 0.0319218 -0.1508656 -0.0505998 0.005711 -0.0057939 0.0633169 0.0304854 0.0517281 -0.1219849 0.0594726 0.0678914 0.0469993 -0.091017 0.0253931 -0.0024812 unknown
polarizability: 101.872528|1.8565633|66.1080246|0.5044423|-3.5941842|60.7032064 unknown
InChI: InChI=1S/C5H12N2O2/c1-2-9-5(8)7-4-3-6/h7H,2-4,6H2,1H3
charge 0 multiplicity 1
21 atoms
O  1.745245 -0.439343 0.881491
O  0.580899 1.360159 -0.121989
N  -0.527232 -0.427702 0.929208
N  -3.850363 -0.00985 -0.839503
C  -1.89121 0.046135 0.660416
C  -2.497651 -0.556347 -0.631679
C  3.031491 0.180346 0.460276
C  0.581816 0.264097 0.49927
C  3.4023 -0.231091 -0.967903
H  -1.848984 1.146083 0.565802
H  -2.548117 -0.198587 1.513612
H  -2.581182 -1.653678 -0.515667
H  -1.787258 -0.367465 -1.469817
H  -0.372353 -1.310985 1.415622
H  2.939279 1.277574 0.546164
H  3.756456 -0.197344 1.199756
H  -4.454739 -0.567934 -1.447228
H  -3.869216 0.984983 -1.082893
H  4.400319 0.169665 -1.226968
H  3.435257 -1.33031 -1.065402
H  2.671346 0.17219 -1.688869
