program: Gaussian 09
title: 000240735
version: EM64L-G09RevD.01
frameworkgroup: C1[X(C13H19N5)]
method: RPBEPBE
basis: SDD
operation: Freq
keyword: #pfreq=noraman
keyword: PBEPBE/SDD
title: #p freq=noraman PBEPBE/SDD
converged: NO YES NO NO
title: Mulliken charges:
elementType: N N N N N C C C C C C C C C C C C C H H H H H H H H H H H H H H H H H H H
charge: -0.202203 -0.038623 -0.049544 -0.371141 -0.085973 -0.010752 -0.433899 -0.433872 -0.390667 -0.390646 -0.392719 0.137213 0.004844 -0.424308 0.211345 -0.371766 -0.300309 -0.721388 0.246685 0.210169 0.222869 0.222832 0.210184 0.195146 0.201548 0.201556 0.195131 0.193718 0.200595 0.255202 0.314959 0.241662 0.237859 0.239184 0.220896 0.219809 0.234403
chargesum: 0.00000
title: Mulliken charges with hydrogens summed into heavy atoms:
elementType: N N N N N C C C C C C C C C C C C C
charge: -0.202203 -0.038623 -0.049544 -0.056182 -0.085973 0.235934 -0.000861 -0.000856 0.006026 0.006040 0.001594 0.137213 0.004844 -0.169106 0.211345 -0.130104 0.176734 -0.046279
polarizability: 2.58670872e+02 3.46490051e-01 1.65280097e+02 -8.17780273e-02 1.38117544e-01 1.12632856e+02
1716.lowfreq: -37.4407 -11.1207 -0.0005 -0.0002 0.0007 4.2077 13.0319 22.8550 49.7013
frequency: -35.1484 18.0052 49.5017 60.5001 100.9236 113.4953 151.4004 180.6017 209.9107 220.8333 234.2640 253.6579 292.8958 315.1263 324.9865 350.6870 375.7530 427.3898 432.8086 441.6605 496.2710 512.2284 558.1349 605.8932 639.5415 640.4875 672.5533 738.6833 760.8727 783.2167 785.9953 791.1427 813.3917 819.7914 852.5281 863.5330 883.9341 894.0038 898.2927 921.5349 933.8708 985.8878 989.4990 1042.7871 1048.7270 1053.0114 1061.7296 1075.7228 1111.4684 1127.4637 1142.6628 1155.8554 1166.7455 1194.8517 1216.9163 1223.0625 1251.2480 1255.5227 1256.6678 1261.3432 1297.6233 1307.5431 1319.4174 1328.1597 1331.9125 1334.7536 1336.1622 1340.7108 1344.1440 1355.2368 1368.7652 1389.3015 1396.0396 1419.3001 1437.7906 1462.4541 1464.3308 1465.1436 1471.6180 1478.4501 1478.6588 1482.3049 1485.7443 1496.8656 1532.9036 1595.9828 2967.6184 2968.0131 2970.7503 2979.8840 2988.2089 2990.3936 2997.2609 3008.9952 3031.1119 3031.9253 3037.3350 3040.4981 3051.7963 3060.3693 3075.3952 3092.5825 3157.9482 3207.6729 3570.3972
redmass: 2.1700 4.0058 3.4471 3.8469 3.0850 3.5446 3.3399 3.3977 4.4795 1.8594 4.3602 1.4223 4.2438 2.5710 3.3254 2.4767 4.4852 2.7785 3.2761 1.1443 1.6054 5.2160 4.0362 6.9917 6.2687 6.4483 11.5980 5.6987 2.9279 2.3534 1.5333 1.1164 3.7320 2.0034 1.8193 3.3839 2.1197 1.5532 3.1183 1.7902 1.4382 3.1077 2.6264 2.8622 1.8172 1.1419 2.7327 1.3388 2.5033 4.8802 1.5263 2.5558 2.6680 1.5468 2.0187 3.8380 1.5733 1.2773 1.1009 1.3236 3.8074 1.3016 1.5770 1.9943 1.3788 1.8435 1.3928 1.4855 1.4959 3.3504 1.7237 1.6486 1.2432 3.5172 2.4524 1.0864 1.0912 1.0881 1.0840 1.1674 1.0749 1.1027 2.3379 1.1135 8.1700 6.5079 1.0628 1.0643 1.0616 1.0371 1.0602 1.0620 1.0593 1.0844 1.0980 1.0950 1.1031 1.1024 1.1041 1.1028 1.1016 1.0979 1.0919 1.0971 1.0777
irintensity: 0.3364 0.4423 2.6098 1.1467 0.4925 0.2591 0.1475 2.2832 1.8309 0.4013 0.5844 0.1662 2.3637 3.1149 1.3715 2.0848 7.9327 0.9344 0.0169 91.6929 1.7066 1.4442 0.1967 10.1079 0.0890 11.8111 2.2733 4.4450 3.2175 26.7200 7.0310 0.7972 17.6200 9.5141 1.0017 14.5226 11.0502 16.6218 19.1501 0.0016 10.5182 35.1671 1.0865 9.9189 1.1563 0.4970 1.3435 0.7356 0.1058 12.9208 2.0987 8.5748 14.3489 0.1185 3.9495 19.1497 28.3522 1.0569 0.0734 0.3603 74.1671 0.2303 1.3110 25.1223 0.3070 106.0750 0.0266 0.3831 0.7102 47.5501 1.0567 2.2854 36.9037 77.6536 42.8184 2.1377 5.1478 12.0543 22.3838 22.8334 16.5197 2.4357 8.4125 30.0686 134.3798 651.5006 26.2734 45.7759 36.6539 31.3019 23.3776 15.1957 28.2421 10.5529 72.8044 70.1934 4.4831 34.9839 8.7420 65.2501 56.0221 32.1294 21.6155 3.4539 52.9028
temp: 298.150 k
press: 1.00000 atm
elementType: 7 7 7 7 7 6 6 6 6 6 6 6 6 6 6 6 6 6 1 1 1 1 1 1 1 1 1 1 1 1 1 1 1 1 1 1 1
symmnumber: 1
zpe: 819387.8 jmol-1
zpe.correction: 0.312088 hartree
zpe.thermalcorrener: 0.327747 hartree
zpe.thermalcorrenthalpy: 0.328691 hartree
zpe.thermalcorrgfe: 0.268149 hartree
zpe.sumelectzpe: -779.196361 hartree
zpe.sumelectthermal: -779.180702 hartree
zpe.sumelectthermalent: -779.179758 hartree
zpe.sumelectthermalfe: -779.240300 hartree
dipole: 1.7780 -2.1778 -0.0006
dipole: 2.8114
quadrupole: -84.3040 -110.2018 -108.9005
quadrupole: -10.5072 -0.0319 0.0226
quadrupole: 16.8315 -9.0663 -7.7651 -10.5072 -0.0319 0.0226
hfenergy: -779.5084492 hartree
pointgroup: C01 [X(C13H19N5)]
dipole: 0.6874209 -0.8665292 0.0004173 debye
polarizability: 258.6622367|-0.9630043|165.288911|-0.0703741|0.1021249|112.6326772 unknown
InChI: InChI=1S/C13H19N5/c1-2-14-12-11-8-17-18(13(11)16-9-15-12)10-6-4-3-5-7-10/h8-10,14H,2-7H2,1H3
charge 0 multiplicity 1
37 atoms
N  -0.948549 -0.319376 -0.003572
N  -0.661022 -1.687292 -0.008157
N  0.2949 1.809718 0.001529
N  3.764302 -0.626779 -0.00639
N  2.733029 1.487941 -0.00158
C  -2.345517 0.162916 0.000341
C  -3.083994 -0.303233 1.278999
C  -3.088421 -0.29419 -1.278995
C  -4.550478 0.190805 1.278832
C  -4.554879 0.199921 -1.270127
C  -5.300138 -0.264506 0.004002
C  0.206653 0.441379 -0.002526
C  1.304651 -0.477645 -0.00613
C  0.699409 -1.77756 -0.009503
C  2.612991 0.118674 -0.005006
C  1.584718 2.240747 0.001497
C  5.112856 -0.027408 -0.005273
C  6.18535 -1.128049 0.018825
H  -2.260716 1.267244 0.004103
H  -2.549004 0.070771 2.172423
H  -3.055919 -1.409391 1.314545
H  -3.060498 -1.400065 -1.322576
H  -2.556576 0.086227 -2.171588
H  -4.566339 1.299297 1.334352
H  -5.066878 -0.181766 2.184064
H  -5.0745 -0.165966 -2.176235
H  -4.570786 1.308794 -1.317471
H  -5.376363 -1.371419 0.000159
H  -6.3342 0.130959 0.007205
H  1.154981 -2.767004 -0.012933
H  3.685398 -1.643927 -0.010156
H  1.734399 3.324984 0.004826
H  5.226144 0.615245 -0.898396
H  5.211428 0.640131 0.870855
H  6.099362 -1.755796 0.925666
H  6.112997 -1.782992 -0.869962
H  7.191311 -0.674485 0.019253
