program: Gaussian 09
title: 000240743
version: EM64L-G09RevD.01
frameworkgroup: C1[X(C14H11N3O3)]
method: RPBEPBE
basis: SDD
operation: Freq
keyword: #p
keyword: freq=noraman
keyword: PBEPBE/SDD
title: #p freq=noraman PBEPBE/SDD
converged: YES YES NO NO
title: Mulliken charges:
elementType: O O O N N N C C C C C C C C C C C C C C H H H H H H H H H H H
charge: -0.260418 -0.256505 -0.216988 0.057596 -0.409791 -0.001516 0.221319 0.175667 0.505104 -0.481962 -0.329502 -0.202312 -0.388748 -0.387666 0.276460 0.184556 -0.310376 -0.282753 -0.327597 -0.321966 0.305011 0.254930 0.242159 0.242155 0.228468 0.208518 0.288222 0.222628 0.273014 0.244163 0.248130
chargesum: 0.00000
title: Mulliken charges with hydrogens summed into heavy atoms:
elementType: O O O N N N C C C C C C C C C C C C C C
charge: -0.260418 -0.256505 -0.216988 0.057596 -0.121569 -0.001516 0.221319 0.175667 0.505104 -0.176950 -0.074572 0.282002 -0.160280 -0.179149 0.276460 0.184556 -0.087748 -0.009739 -0.083434 -0.073836
polarizability: 4.07336543e+02 -8.11974377e+00 1.83126008e+02 -3.05204193e+00 4.64537771e+00 8.09646022e+01
1716.lowfreq: -5.5495 -0.0011 -0.0010 -0.0005 3.5453 4.5833 14.7141 23.0244 33.3226
frequency: 11.6810 23.0057 33.2846 38.6555 59.1388 99.6832 111.4009 172.6386 208.2121 214.9014 216.3281 235.6044 291.0348 349.5396 365.5888 369.9326 380.5433 418.6489 439.2984 478.8274 501.5255 574.0892 607.0647 617.1832 628.8477 659.5939 668.8500 680.9447 688.7930 723.8830 752.6573 764.0281 790.2071 809.1787 836.7182 840.1459 876.0071 890.3777 907.2309 924.7171 941.2132 945.9946 957.3546 965.6426 979.5151 987.6287 1025.5276 1061.3574 1062.9722 1065.8336 1086.5289 1119.4113 1120.0226 1142.4769 1196.6701 1219.1031 1242.8504 1256.4515 1264.1834 1299.7309 1324.2789 1338.7490 1365.6728 1394.7985 1399.7173 1457.5717 1461.0298 1475.2122 1487.3214 1513.1957 1546.3772 1569.3788 1581.8361 1606.9501 1619.8098 1624.6372 2963.4351 3018.6191 3098.1742 3125.6635 3136.9542 3142.0645 3149.7140 3174.5670 3184.2368 3187.3420 3381.9564
redmass: 2.4385 6.3263 4.8634 6.4310 6.6773 7.0676 7.1362 8.0417 4.0486 6.5300 5.6327 6.3083 5.2738 7.9741 2.5833 4.8300 6.8384 5.4080 3.4290 5.6794 5.2209 6.0701 2.5473 6.6643 1.5850 6.3850 7.4296 9.6007 4.5313 4.4244 2.9473 6.9288 5.5928 1.3526 1.6698 9.5961 7.2367 1.2618 1.3534 1.3940 3.7006 1.5318 3.0558 1.9382 4.4381 1.4451 6.3883 2.1903 3.8258 1.4547 1.6361 2.4116 1.0374 1.7461 1.8120 1.3214 2.8572 1.7498 2.1375 6.4344 1.5378 1.7839 1.2868 3.4374 1.9408 3.5850 2.0843 2.5001 1.2506 2.0035 7.4889 6.0600 5.7400 7.5616 8.5385 7.6652 1.0869 1.0534 1.1190 1.0873 1.0899 1.0897 1.0972 1.0966 1.0951 1.0943 1.0751
irintensity: 15.6149 0.4537 0.0949 0.6761 4.1917 2.7550 5.5860 9.7459 8.0878 2.0505 1.4585 12.8511 7.0353 1.2589 0.0452 1.5472 7.2091 15.8423 3.4858 3.6167 9.2664 1.2445 2.2461 5.6736 82.1281 1.4442 48.3020 2.1191 26.3676 4.0673 9.8762 11.1063 11.0140 37.3728 30.7525 27.1574 25.6252 3.9388 2.3032 31.4634 1.3402 30.1292 0.8133 1.9061 171.5355 3.1822 24.8230 20.0254 12.0835 4.3254 29.4549 139.1857 0.1170 19.5704 54.8235 21.1310 221.9346 198.8428 179.5352 0.1995 0.8390 21.9840 0.5462 53.8531 16.8385 84.4271 78.5823 175.4706 29.8657 192.7119 45.0597 100.3007 4.2275 0.5789 208.3708 15.9184 57.3749 140.3511 29.1701 11.4444 9.2787 30.0808 15.7778 6.3157 3.5838 7.1176 14.4922
temp: 298.150 k
press: 1.00000 atm
elementType: 8 8 8 7 7 7 6 6 6 6 6 6 6 6 6 6 6 6 6 6 1 1 1 1 1 1 1 1 1 1 1
symmnumber: 1
zpe: 595319.9 jmol-1
zpe.correction: 0.226745 hartree
zpe.thermalcorrener: 0.243509 hartree
zpe.thermalcorrenthalpy: 0.244453 hartree
zpe.thermalcorrgfe: 0.178200 hartree
zpe.sumelectzpe: -928.552787 hartree
zpe.sumelectthermal: -928.536024 hartree
zpe.sumelectthermalent: -928.535080 hartree
zpe.sumelectthermalfe: -928.601333 hartree
dipole: -3.2475 4.1177 -0.4561
dipole: 5.2640
quadrupole: -115.2045 -108.6129 -116.7489
quadrupole: 6.5170 -2.1261 2.3760
quadrupole: -1.6824 4.9092 -3.2268 6.5170 -2.1261 2.3760
hfenergy: -928.7795325 hartree
pointgroup: C01 [X(C14H11N3O3)]
dipole: 1.2743928 -1.0514833 1.2487869 debye
polarizability: 406.6234184|6.5265274|110.9253481|15.8732806|-46.3271085|153.8783862 unknown
InChI: InChI=1S/C14H11N3O3/c18-14(11-3-5-15-6-4-11)17-16-8-10-1-2-12-13(7-10)20-9-19-12/h1-8,17H,9H2
charge 0 multiplicity 1
31 atoms
O  4.790046 1.286933 -1.278612
O  6.202875 0.004299 0.181156
O  -2.200928 1.099259 -1.73608
N  -0.21022 -0.054191 -0.116733
N  -1.564162 -0.283083 0.056351
N  -6.710136 -0.456217 0.104045
C  4.007122 0.461086 -0.43541
C  4.845485 -0.292683 0.423771
C  2.065251 -0.55875 0.54916
C  2.622743 0.357113 -0.403723
C  4.325797 -1.190142 1.359576
C  6.203429 1.01857 -0.913538
C  2.913232 -1.311829 1.408753
C  0.615661 -0.735935 0.652878
C  -3.943642 0.046639 -0.413821
C  -2.506909 0.354101 -0.767746
C  -4.389603 -0.328807 0.8801
C  -4.916195 0.186297 -1.434947
C  -5.767972 -0.566642 1.08647
C  -6.269307 -0.078119 -1.13553
H  1.966849 0.931604 -1.061818
H  4.97835 -1.767804 2.018232
H  6.663754 1.947619 -0.536703
H  6.730455 0.598085 -1.786782
H  2.465862 -2.006766 2.128849
H  0.258304 -1.466422 1.408577
H  -1.892689 -0.970849 0.751156
H  -3.706183 -0.39809 1.734345
H  -4.602424 0.50407 -2.433554
H  -6.143463 -0.848974 2.076503
H  -7.041979 0.013231 -1.906526
