program: Gaussian 09
title: 000240689
version: EM64L-G09RevD.01
frameworkgroup: C1[X(C11H14N2)]
method: RPBEPBE
basis: SDD
operation: Freq
keyword: #pfreq=noraman
keyword: PBEPBE/SDD
title: #p freq=noraman PBEPBE/SDD
converged: YES YES NO NO
title: Mulliken charges:
elementType: N N C C C C C C C C C C C H H H H H H H H H H H H H H
charge: -0.459572 -0.061224 0.305121 -0.025904 0.182081 0.386238 0.361541 -0.584278 -0.564983 -0.494477 -0.823978 -0.824683 -0.671642 0.301003 0.235213 0.251181 0.214429 0.253889 0.224921 0.227110 0.224958 0.234539 0.221296 0.221447 0.239973 0.228193 0.197608
chargesum: 0.00000
title: Mulliken charges with hydrogens summed into heavy atoms:
elementType: N N C C C C C C C C C C C
charge: -0.158569 -0.061224 0.305121 -0.025904 0.182081 0.386238 0.361541 -0.349065 -0.313802 -0.026159 -0.146990 -0.147400 -0.005868
polarizability: 2.06381651e+02 -9.05593990e-01 1.26601320e+02 5.45322430e+00 -1.37328658e+00 7.41047419e+01
1716.lowfreq: -9.2340 -7.1415 -2.6637 0.0006 0.0007 0.0008 19.3566 75.0589 119.1372
frequency: 18.6534 75.0118 119.1357 144.7689 154.2370 172.3190 191.1380 245.1445 291.6327 300.4727 328.5916 365.2872 393.9015 432.6979 448.3942 471.1979 567.3722 586.9067 643.9707 654.4950 703.6263 729.0967 767.2847 774.2997 784.1198 858.1203 858.7492 893.2409 942.6983 991.2516 1001.2372 1004.5346 1030.6666 1048.9073 1052.3624 1067.0411 1105.7192 1167.6147 1203.8079 1222.0368 1239.3591 1263.9545 1303.7366 1318.8201 1366.7479 1390.2798 1391.4792 1393.4967 1406.8433 1442.1014 1461.7042 1463.3891 1464.0907 1475.9261 1476.6751 1479.3446 1482.2732 1491.0023 1532.0564 1587.2340 1649.1961 2965.6718 2966.8046 2981.9068 2984.2917 3035.5924 3039.2448 3064.3699 3078.2469 3083.5261 3085.9385 3095.0553 3129.3318 3148.8143 3597.0957
redmass: 2.4587 3.3240 1.3220 2.0127 2.1519 1.2922 1.3657 1.7963 3.2188 2.6969 3.9880 2.8734 4.6790 3.1065 3.8732 4.5598 3.1905 1.1819 4.3204 3.8669 4.2686 4.7371 3.2960 3.5628 1.5338 1.5461 2.6512 1.4564 4.0429 2.2393 1.4262 1.5628 1.4353 1.9763 1.6257 1.7721 3.6002 1.7497 2.8853 2.0991 1.3381 1.3708 4.8668 1.5899 3.3170 1.5065 1.8873 1.3930 1.3273 1.9661 1.0606 1.2652 2.0004 1.0508 1.0468 1.1592 1.1301 1.6744 4.4566 8.0227 7.5192 1.0378 1.0378 1.0426 1.0600 1.0970 1.0969 1.0963 1.0984 1.0974 1.0968 1.1010 1.0921 1.0923 1.0810
irintensity: 0.2565 2.7985 0.7607 4.2444 0.9311 0.7104 0.0300 2.3885 0.5183 0.1883 2.8235 1.3984 2.8570 7.9317 3.1884 2.6741 3.2693 100.6196 1.6291 0.3888 2.1412 0.0614 0.6375 0.1658 2.9026 26.6041 5.3144 11.7172 1.7610 3.0668 25.6814 4.4568 17.4325 8.0892 0.0058 8.9535 3.2106 5.5559 1.7143 8.9512 11.8103 9.2144 15.4071 25.7313 41.9334 4.8529 4.7958 5.7831 13.3157 22.6455 1.0427 14.1427 33.3851 15.3655 29.3567 3.4199 10.5645 9.3915 53.1471 2.4442 5.9082 66.4904 35.0997 35.8978 35.1606 44.1319 5.5447 12.8176 34.1697 11.5939 46.9032 34.7351 17.4734 7.5844 32.2835
temp: 298.150 k
press: 1.00000 atm
elementType: 7 7 6 6 6 6 6 6 6 6 6 6 6 1 1 1 1 1 1 1 1 1 1 1 1 1 1
symmnumber: 1
zpe: 593032.8 jmol-1
zpe.correction: 0.225874 hartree
zpe.thermalcorrener: 0.238509 hartree
zpe.thermalcorrenthalpy: 0.239453 hartree
zpe.thermalcorrgfe: 0.186423 hartree
zpe.sumelectzpe: -536.145227 hartree
zpe.sumelectthermal: -536.132592 hartree
zpe.sumelectthermalent: -536.131648 hartree
zpe.sumelectthermalfe: -536.184679 hartree
dipole: -0.5809 3.4452 -0.0697
dipole: 3.4945
quadrupole: -63.2323 -74.8136 -81.1447
quadrupole: -6.4450 1.3273 -1.4244
quadrupole: 9.8312 -1.7501 -8.0812 -6.4450 1.3273 -1.4244
hfenergy: -536.3711016 hartree
pointgroup: C01 [X(C11H14N2)]
dipole: 0.2043457 1.3531442 -0.1319985 debye
polarizability: 206.3688096|2.8895171|126.2837308|4.5396066|-4.6639321|74.435173 unknown
InChI: InChI=1S/C11H14N2/c1-4-11-12-9-5-7(2)8(3)6-10(9)13-11/h5-6,12H,4H2,1-3H3
charge 0 multiplicity 1
27 atoms
N  1.519192 1.024737 0.131611
N  1.481355 -1.249206 0.302782
C  0.162839 0.669026 0.057444
C  0.157857 -0.760039 0.16729
C  2.267381 -0.157988 0.280155
C  -2.251849 0.707044 -0.117088
C  -2.274547 -0.730869 -0.009506
C  -1.025711 1.410916 -0.083267
C  -1.07034 -1.455066 0.132096
C  3.766844 -0.158022 0.380168
C  -3.553105 1.477251 -0.266561
C  -3.600094 -1.473586 -0.048204
C  4.472624 0.334089 -0.911895
H  1.901922 1.966888 0.083293
H  -1.02112 2.503768 -0.165089
H  -1.080946 -2.546777 0.214633
H  4.091709 0.464465 1.238021
H  4.068355 -1.195994 0.598367
H  -4.231934 1.300562 0.590185
H  -3.370852 2.563611 -0.332798
H  -4.106183 1.171829 -1.175954
H  -3.44639 -2.561545 0.048957
H  -4.274159 -1.154132 0.770389
H  -4.144616 -1.293756 -0.995745
H  4.172781 -0.283202 -1.776442
H  5.569376 0.264877 -0.800032
H  4.224614 1.386918 -1.14341
