program: Gaussian 09
title: 000240679
version: EM64L-G09RevD.01
frameworkgroup: C1[X(C19H15ClN2)]
method: RPBEPBE
basis: SDD
operation: Freq
keyword: #p
keyword: freq=noraman
keyword: PBEPBE/SDD
title: #p freq=noraman PBEPBE/SDD
converged: YES YES NO NO
title: Mulliken charges:
elementType: Cl N N C C C C C C C C C C C C C C C C C C C H H H H H H H H H H H H H H H
charge: -0.117627 -0.259222 0.036370 0.390663 0.401390 -0.358078 -0.357710 -0.329170 -0.350314 -0.271116 -0.206192 -0.213039 -0.208852 -0.217525 -0.242519 -0.249087 0.321436 -0.345115 -0.384340 -0.211667 -0.201016 -0.249899 0.261161 0.263635 0.260015 0.253441 0.230057 0.229068 0.230476 0.229959 0.231517 0.231177 0.263754 0.254069 0.226879 0.228419 0.229001
chargesum: 0.00000
title: Mulliken charges with hydrogens summed into heavy atoms:
elementType: Cl N N C C C C C C C C C C C C C C C C C C C
charge: -0.117627 -0.259222 0.036370 0.390663 0.401390 -0.096917 -0.094075 -0.069154 -0.096873 -0.271116 0.023866 0.016029 0.021624 0.012434 -0.011002 -0.017910 0.321436 -0.081361 -0.130271 0.015212 0.027403 -0.020898
polarizability: 3.48668226e+02 1.03720967e+01 2.36659392e+02 -2.20214676e+00 4.24519720e+00 1.62964179e+02
1716.lowfreq: -7.4113 -3.1739 0.0008 0.0010 0.0010 6.6564 17.8690 26.5654 31.1818
frequency: 17.0648 26.4508 31.0564 45.8183 54.3440 66.3238 71.0369 120.6109 132.5798 199.7102 212.9062 240.5581 254.9957 257.8871 308.4026 333.2564 405.1619 408.0261 408.2947 424.3905 468.5162 481.7528 519.7754 524.8931 545.9990 573.2307 606.1920 611.8064 616.6462 624.2851 654.3142 692.3367 693.2293 696.7139 737.7646 761.3039 767.9742 775.9028 795.2268 835.2658 841.5921 844.9132 906.7949 914.2825 918.6921 934.8759 968.9937 973.0456 974.8533 985.7170 987.5816 989.2379 989.7262 990.9512 994.4348 1021.0506 1022.8524 1027.2662 1077.5766 1079.2756 1085.0065 1101.2365 1169.8209 1172.4524 1172.8472 1179.3413 1183.0439 1187.8773 1201.0701 1255.9870 1299.7084 1312.4191 1315.9980 1333.8842 1374.2024 1378.4152 1387.4662 1439.1983 1439.7209 1445.4318 1477.2548 1478.3406 1481.5724 1577.0447 1591.5314 1597.4231 1603.0228 1604.0926 1609.3870 1757.8582 3127.9091 3131.0836 3131.3469 3138.0390 3140.2037 3140.5296 3152.5148 3155.3650 3156.0958 3160.6766 3164.5750 3167.1534 3172.0133 3174.0882 3175.1199
redmass: 4.8267 4.1139 5.7135 4.9552 4.5108 4.9247 5.9501 6.9277 5.6219 5.4271 7.6570 5.0456 5.8290 6.8808 4.7736 6.1038 2.8589 2.9078 2.8575 6.0336 4.4694 4.3590 3.9455 6.9309 4.9283 6.7115 6.1731 6.2908 6.4090 6.8945 6.4386 1.9275 2.0101 1.9627 3.3569 1.7800 1.8302 2.2658 4.6723 1.2593 1.2475 1.2492 1.6170 1.5933 1.4440 3.1220 1.3775 1.3797 1.3875 5.7457 5.0605 5.8297 1.3810 1.3252 1.3239 2.3457 2.2549 2.0148 1.8069 1.5578 1.6236 2.6100 1.0678 1.0517 1.0490 1.2147 1.1136 1.1402 2.7530 4.4448 2.2170 1.3952 1.3594 1.8864 6.1616 8.1806 10.0423 2.3990 2.2906 2.3288 2.3170 2.2571 2.4420 6.0233 6.4026 6.6449 6.1315 6.1190 6.1307 12.5690 1.0849 1.0849 1.0849 1.0894 1.0885 1.0890 1.0929 1.0940 1.0931 1.0970 1.0961 1.0965 1.1016 1.1007 1.0990
irintensity: 0.6650 0.5803 1.3102 0.4919 0.8460 0.1085 0.2930 0.6644 3.1006 0.2096 2.9689 5.3053 4.7966 22.5506 2.2969 3.0277 2.2459 1.0693 0.2106 5.7792 16.0497 18.0920 39.5205 13.7277 9.7513 31.7548 27.5639 0.0683 1.0142 19.0122 6.7201 31.4591 45.2900 53.1501 23.4623 51.1443 65.1162 71.9462 32.9228 1.6984 0.1745 0.6006 2.9928 6.0248 8.0648 27.2462 0.0355 0.0951 0.0536 0.5190 0.4562 1.4354 0.2640 0.4234 0.0888 7.7519 12.4663 17.2438 30.7183 6.9198 17.5268 78.3040 0.4476 0.0995 0.2199 8.4568 0.0516 12.3587 85.4913 155.1998 61.9995 2.7015 10.9499 54.4486 3.5100 0.9093 1.5344 5.3096 4.4572 0.3048 78.5919 88.7807 31.7739 10.6849 6.9753 13.9369 111.8377 41.7074 27.6285 893.4849 2.0252 1.5944 1.2657 13.9402 5.7703 7.9586 28.8339 34.1062 25.8336 18.7331 19.0572 16.8786 14.9371 7.0492 9.3777
temp: 298.150 k
press: 1.00000 atm
elementType: 17 7 7 6 6 6 6 6 6 6 6 6 6 6 6 6 6 6 6 6 6 6 1 1 1 1 1 1 1 1 1 1 1 1 1 1 1
symmnumber: 1
zpe: 747337.6 jmol-1
zpe.correction: 0.284646 hartree
zpe.thermalcorrener: 0.303342 hartree
zpe.thermalcorrenthalpy: 0.304286 hartree
zpe.thermalcorrgfe: 0.234268 hartree
zpe.sumelectzpe: -1301.063909 hartree
zpe.sumelectthermal: -1301.045213 hartree
zpe.sumelectthermalent: -1301.044269 hartree
zpe.sumelectthermalfe: -1301.114287 hartree
dipole: -1.5297 1.6725 0.2148
dipole: 2.2767
quadrupole: -113.8158 -130.4320 -128.4935
quadrupole: 2.5977 -2.5523 -2.6567
quadrupole: 10.4313 -6.1849 -4.2464 2.5977 -2.5523 -2.6567
hfenergy: -1301.3485548 hartree
pointgroup: C01 [X(C19H15Cl1N2)]
dipole: 0.7216018 0.5085608 -0.1516439 debye
polarizability: 340.3293634|-30.6249473|241.5812747|5.8160235|-17.0839325|166.3811599 unknown
InChI: InChI=1S/C19H15ClN2/c20-19(21-16-10-4-1-5-11-16)22(17-12-6-2-7-13-17)18-14-8-3-9-15-18/h1-15H
charge 0 multiplicity 1
37 atoms
Cl -0.884817 -2.282763 1.185284
N  0.843449 -0.343062 0.179006
N  -1.430274 0.03832 -0.383971
C  1.857843 -1.377056 0.254378
C  1.273517 1.032807 -0.001829
C  2.885401 -1.270752 1.220947
C  2.409618 1.307944 -0.803027
C  1.838137 -2.464285 -0.650648
C  0.583458 2.094888 0.633708
C  -0.513483 -0.64673 0.16716
C  3.89226 -2.257268 1.282477
C  2.851413 2.639361 -0.96152
C  2.84142 -3.454489 -0.574982
C  1.029028 3.42173 0.46252
C  3.872456 -3.353699 0.388053
C  2.164922 3.702953 -0.332897
C  -2.82904 0.104891 -0.289282
C  -3.562549 -0.270576 0.8734
C  -3.524169 0.633569 -1.412664
C  -4.965499 -0.126533 0.89293
C  -4.927218 0.761226 -1.385299
C  -5.656184 0.382291 -0.23253
H  2.886338 -0.426261 1.917468
H  2.93916 0.488276 -1.297951
H  1.040239 -2.533151 -1.397088
H  -0.292516 1.885869 1.254431
H  4.684293 -2.175969 2.034796
H  3.729042 2.843039 -1.584843
H  2.820361 -4.300245 -1.270773
H  0.490606 4.236816 0.958317
H  4.651389 -4.121947 0.441942
H  2.508383 4.73502 -0.460333
H  -3.034208 -0.670186 1.743357
H  -2.942344 0.936054 -2.288944
H  -5.522417 -0.414829 1.791667
H  -5.451747 1.16328 -2.259091
H  -6.746267 0.487966 -0.209067
