program: Gaussian 09
title: 000240672
version: EM64L-G09RevD.01
frameworkgroup: C1[X(C17H13N3O6S)]
method: RPBEPBE
basis: SDD
operation: Freq
keyword: #p
keyword: freq=noraman
keyword: PBEPBE/SDD
title: #p freq=noraman PBEPBE/SDD
converged: YES YES NO NO
title: Mulliken charges:
elementType: S O O O O O O N N N C C C C C C C C C C C C C C C C C H H H H H H H H H H H H H
charge: 0.267718 -0.258164 -0.241138 -0.421023 -0.424039 -0.228478 -0.228811 -0.465695 -0.463646 0.028045 0.285139 0.374567 0.566492 -0.623007 -0.341666 -0.397836 -0.330301 -0.347361 0.191834 0.190412 -0.445144 -0.243634 -0.249802 -0.260956 -0.271378 0.171109 0.177731 0.309182 0.252413 0.315617 0.346211 0.333087 0.303790 0.274976 0.282665 0.284684 0.253924 0.258333 0.387318 0.386830
chargesum: 0.00000
title: Mulliken charges with hydrogens summed into heavy atoms:
elementType: S O O O O O O N N N C C C C C C C C C C C C C C C C C
charge: 0.267718 -0.258164 -0.241138 -0.033705 -0.037209 -0.228478 -0.228811 -0.119484 -0.130559 0.028045 0.285139 0.374567 0.566492 -0.313825 -0.089253 -0.082219 -0.330301 -0.043571 0.191834 0.190412 -0.170168 0.039031 0.034882 -0.007032 -0.013045 0.171109 0.177731
polarizability: 4.76473451e+02 -2.18886730e+01 2.96857796e+02 1.80979392e+01 1.21483275e+01 1.21102614e+02
1716.lowfreq: -3.1983 0.0009 0.0011 0.0015 1.7069 3.7050 13.8292 17.3209 27.5854
frequency: 13.7796 17.3135 27.5831 32.2378 37.0742 40.2569 50.8909 58.2105 82.0777 86.3000 97.4359 112.0462 136.9465 146.5168 154.7296 158.5151 171.5099 185.3786 194.4786 221.4115 252.3034 278.0422 295.4691 329.9611 370.1391 380.7020 388.8993 440.8505 452.2330 474.8802 482.6889 529.9941 539.9983 553.7405 571.4729 582.5552 584.6685 595.2427 607.2392 619.3389 621.9865 645.4255 647.7324 657.9685 673.5879 679.0548 696.3292 719.2941 728.2216 734.4358 752.3552 763.4548 799.4497 823.2274 854.0134 861.6128 882.3892 891.3817 903.7534 923.0933 927.0437 930.1919 932.8661 961.0833 985.2610 997.0380 1004.9096 1010.2678 1055.7875 1056.8665 1103.8684 1129.4031 1183.4358 1200.9348 1220.6544 1224.0670 1228.3224 1230.0813 1247.1470 1251.5966 1263.4895 1270.6963 1289.3604 1314.3825 1328.9016 1332.5508 1361.4312 1406.4721 1428.7050 1463.9420 1483.9402 1513.2286 1532.8068 1570.8231 1580.5268 1590.0075 1622.4792 1637.6135 1639.5643 1651.7511 1655.4021 3138.8463 3144.4744 3145.5409 3149.8137 3151.2401 3152.3743 3181.6710 3203.6452 3227.4047 3476.4169 3521.0465 3524.7082 3525.2242
redmass: 7.3465 8.3752 8.6279 9.6585 9.2224 9.9469 8.6084 9.3612 7.3172 6.5791 6.1871 6.6557 3.2803 4.7872 3.3747 4.2695 7.7643 7.7595 6.6094 6.3705 7.0772 4.8516 7.1939 8.2158 6.8924 7.4388 5.5569 4.7565 6.7128 3.8253 5.9759 4.3100 3.7627 2.9790 2.3596 3.0477 3.7745 4.8681 4.4241 4.8940 2.6829 1.7025 1.8722 6.6565 3.1402 1.9133 1.4618 6.4813 8.4517 7.3514 2.8951 1.3440 5.4389 6.1003 1.3394 1.4185 2.8047 2.1787 3.8434 6.7778 1.6456 4.3410 5.6774 4.5103 1.3283 1.1233 1.1323 2.9010 2.1768 2.1672 2.6736 1.8467 2.2166 1.6494 1.7514 1.5415 1.4432 1.7341 2.2195 1.7364 1.3682 1.3827 1.8500 2.3489 2.1081 2.0863 6.0699 4.0866 8.7119 2.9876 3.3752 2.6270 3.1952 7.5276 6.5528 3.2142 6.0013 8.7705 8.6943 6.1559 5.7570 1.0967 1.0977 1.0912 1.0879 1.0868 1.0930 1.0948 1.0950 1.0965 1.0762 1.0765 1.0642 1.0643
irintensity: 0.4243 1.5344 1.3936 0.4968 0.4162 0.6030 0.6752 2.2212 1.9914 2.6561 1.1962 1.8006 0.8286 1.7489 6.2818 8.0416 0.7129 0.3210 2.2481 2.0813 0.8038 2.2889 1.1368 23.4976 3.6042 13.3019 0.1731 9.4106 8.7195 3.9552 13.7261 25.2425 76.2952 26.5189 39.9818 50.5394 43.9764 19.4942 6.0191 32.4645 13.2717 34.5535 150.4834 7.5319 19.6914 16.5782 36.5058 8.3970 67.5773 14.6632 21.9055 28.2002 34.2110 5.9929 40.0891 17.9054 2.0946 3.9684 12.2729 3.8062 46.8294 16.5709 14.4800 12.1061 1.9639 58.6766 52.7845 54.5925 336.3905 369.1961 4.9417 2.0935 10.1086 82.8301 40.1868 2.1894 8.1331 53.5671 76.0709 23.5551 32.1802 7.5983 0.5579 38.7736 164.1021 121.0979 146.4484 244.9916 121.3765 108.0036 267.2771 209.2372 181.2787 201.7027 238.3947 26.7225 84.5042 341.1155 291.6846 35.0394 25.3288 6.9681 8.8773 5.5790 1.2719 3.6293 20.5582 5.7860 9.8565 2.0711 55.1132 11.6892 60.7790 61.4200
temp: 298.150 k
press: 1.00000 atm
elementType: 16 8 8 8 8 8 8 7 7 7 6 6 6 6 6 6 6 6 6 6 6 6 6 6 6 6 6 1 1 1 1 1 1 1 1 1 1 1 1 1
symmnumber: 1
zpe: 729573.6 jmol-1
zpe.correction: 0.277880 hartree
zpe.thermalcorrener: 0.303409 hartree
zpe.thermalcorrenthalpy: 0.304353 hartree
zpe.thermalcorrgfe: 0.216858 hartree
zpe.sumelectzpe: -1667.359582 hartree
zpe.sumelectthermal: -1667.334053 hartree
zpe.sumelectthermalent: -1667.333109 hartree
zpe.sumelectthermalfe: -1667.420604 hartree
dipole: 2.8420 -0.0734 0.4342
dipole: 2.8759
quadrupole: -161.0420 -171.3624 -166.4694
quadrupole: -25.2539 -8.3845 6.9161
quadrupole: 5.2492 -5.0711 -0.1781 -25.2539 -8.3845 6.9161
hfenergy: -1667.6374618 hartree
pointgroup: C01[X(C17H13N3O6S1)]
dipole: 1.1075571 -0.0733905 0.2193757 debye
polarizability: 472.6207705|-29.4395652|296.0706612|33.2863056|21.6458553|125.7424287 unknown
InChI: InChI=1S/C17H13N3O6S/c21-14(3-5-16(23)24)19-10-1-2-11(13-8-18-9-27-13)12(7-10)20-15(22)4-6-17(25)26/h1-9,19-20,23,25H
charge 0 multiplicity 1
40 atoms
S  2.993291 -3.619212 -0.850415
O  0.569311 2.59025 -0.194843
O  -4.367814 -2.376551 -0.632802
O  6.479858 2.296596 0.7879
O  -6.962739 2.81791 0.681401
O  5.428706 4.210944 -0.029215
O  -8.037453 1.247543 -0.666524
N  1.698073 0.523829 -0.074862
N  -3.083589 -0.408885 -0.427406
N  4.502902 -2.558371 1.074689
C  0.928725 -1.803831 -0.00466
C  0.621389 -0.400213 -0.088602
C  -1.768464 -0.927613 -0.300033
C  -0.719902 0.022672 -0.223664
C  -0.145052 -2.7242 -0.108392
C  -1.482763 -2.318785 -0.254586
C  2.307328 -2.286182 0.182219
C  3.272637 -1.891808 1.11219
C  1.647554 1.916594 -0.127568
C  -4.283904 -1.111708 -0.558827
C  4.526285 -3.480131 0.129209
C  2.961592 2.629381 -0.095242
C  -5.521982 -0.272694 -0.608328
C  4.165379 2.135977 0.31257
C  -5.70694 0.919986 0.025747
C  5.366531 3.009422 0.321044
C  -7.01273 1.621493 -0.050054
H  -0.919021 1.096757 -0.278999
H  0.079467 -3.794626 -0.047947
H  -2.292883 -3.044982 -0.326009
H  2.62792 0.092304 -0.069879
H  -3.149252 0.611781 -0.465314
H  3.100977 -1.161794 1.905955
H  5.371182 -4.133192 -0.086634
H  2.893554 3.683558 -0.391698
H  -6.362029 -0.731998 -1.143923
H  4.32717 1.11075 0.665896
H  -4.939047 1.404731 0.639403
H  7.278894 2.89019 0.78928
H  -7.84196 3.280606 0.620825
