program: Gaussian 09
title: 000245369
version: EM64L-G09RevD.01
frameworkgroup: C1[X(C12H19NO3)]
method: RPBEPBE
basis: SDD
operation: Freq
keyword: #p
keyword: freq=noraman
keyword: PBEPBE/SDD
title: #p freq=noraman PBEPBE/SDD
converged: YES YES NO NO
title: Mulliken charges:
elementType: O O O N C C C C C C C C C C C C H H H H H H H H H H H H H H H H H H H
charge: -0.222770 -0.284813 -0.284732 -0.205531 -0.376797 0.315863 -0.590072 -0.350484 0.035238 0.144638 -0.336480 -0.785691 0.149716 -0.693829 -0.213133 -0.675412 0.212733 0.246516 0.274457 0.273502 0.193386 0.229088 0.203983 0.192204 0.235026 0.237293 0.311407 0.210717 0.219609 0.217563 0.225719 0.224378 0.210079 0.228238 0.228391
chargesum: 0.00000
title: Mulliken charges with hydrogens summed into heavy atoms:
elementType: O O O N C C C C C C C C C C C C
charge: -0.222770 -0.284813 -0.284732 -0.205531 0.082451 0.315863 -0.042112 0.071989 0.035238 0.144638 0.059707 -0.001965 0.149716 -0.045940 0.236964 -0.008703
polarizability: 2.21369281e+02 3.89727014e+00 1.45285343e+02 -1.06393859e+01 3.20109348e+00 1.01782366e+02
1716.lowfreq: -16.7052 -5.5765 -0.0005 -0.0003 0.0005 5.0027 24.4739 26.7720 49.2898
frequency: 23.4024 26.6572 49.1531 56.3735 78.5483 91.3495 95.9538 106.3943 133.2909 154.8175 164.2898 209.0656 223.6019 231.3732 248.7389 269.4794 275.1521 296.6195 301.2443 355.9455 402.2930 417.4309 434.5957 508.4065 566.4022 606.2286 621.8019 701.9949 710.0811 730.8318 734.7955 779.3299 798.7089 802.7823 853.4792 900.1431 916.7505 933.1978 985.9935 1012.2167 1016.9067 1037.5392 1049.4758 1073.3988 1087.2936 1111.4259 1113.5478 1118.4977 1133.4387 1136.3901 1160.7596 1206.7901 1211.6438 1248.0402 1254.2212 1268.3156 1290.0130 1312.5193 1328.2270 1342.8321 1356.3267 1367.5104 1388.2069 1393.8413 1399.5164 1401.2293 1415.1034 1447.8884 1463.7885 1467.8917 1468.7125 1474.3843 1476.0652 1476.6418 1485.6195 1487.8475 1489.4694 1596.7082 1628.4305 1656.3987 2965.3154 2975.3474 2978.6490 2980.1659 2994.2117 3005.9481 3007.7883 3011.1109 3019.4175 3040.9429 3054.6792 3062.7230 3067.4035 3070.2427 3075.6976 3077.0074 3090.6910 3104.5909 3116.0448
redmass: 3.7036 3.5995 2.6425 1.6308 4.2254 3.8213 3.5413 2.4597 3.4459 2.0222 1.2055 3.2449 1.1915 3.1593 1.3129 2.9905 3.4162 2.4663 4.4358 4.7567 4.0076 4.5545 4.2681 2.6109 4.5773 3.8255 4.4375 7.0211 5.2850 5.3938 1.1056 1.3211 1.0999 3.3319 2.6969 1.7397 1.4591 2.4603 2.3717 3.0561 2.1475 3.1856 1.5478 2.5626 4.9149 2.2206 2.3388 1.1722 3.6359 1.4773 2.3222 2.1641 1.6820 1.1340 1.7442 1.3094 1.0870 1.5212 2.2753 1.4440 1.5943 1.7531 1.2705 1.8452 1.3825 1.4517 1.1131 1.0818 1.0405 1.1487 1.0690 1.0576 1.0431 1.0659 1.0606 1.0716 1.0768 11.0229 7.1435 11.4695 1.0591 1.0374 1.0394 1.0594 1.0358 1.0580 1.0702 1.0863 1.0621 1.1020 1.0963 1.1064 1.0990 1.1022 1.1014 1.1021 1.0985 1.1023 1.0983
irintensity: 0.1503 0.6389 0.1605 0.0913 3.6935 0.6991 0.3779 0.2392 1.5385 9.7754 0.3888 3.2882 0.1414 6.4352 3.6752 1.9232 2.5506 4.6071 0.3941 12.3581 1.4701 3.8415 4.8565 1.3392 20.7583 2.2932 1.3547 14.9483 23.6623 5.2545 14.6843 1.1174 3.2381 14.4281 1.0821 4.9264 47.1733 2.0132 100.6125 23.2399 12.2188 293.0084 3.8982 1.1116 44.1770 6.0583 18.1292 1.3498 125.0335 6.4589 26.0661 255.2374 119.6319 0.0087 52.8024 7.1392 1.7239 38.2275 43.5838 8.1740 46.2069 11.2840 15.7128 64.7550 65.0389 92.3418 24.6901 44.0342 12.0868 0.0360 0.3732 6.4307 12.5200 2.2334 7.4449 11.6625 33.3882 279.9661 295.7458 316.5305 26.9360 29.9180 27.6741 27.3493 24.8376 25.8726 30.0008 19.7928 2.6712 10.9094 13.8510 10.5508 1.4200 18.0380 54.7875 64.0278 34.2787 46.5648 0.8561
temp: 298.150 k
press: 1.00000 atm
elementType: 8 8 8 7 6 6 6 6 6 6 6 6 6 6 6 6 1 1 1 1 1 1 1 1 1 1 1 1 1 1 1 1 1 1 1
symmnumber: 1
zpe: 767702.0 jmol-1
zpe.correction: 0.292402 hartree
zpe.thermalcorrener: 0.310820 hartree
zpe.thermalcorrenthalpy: 0.311764 hartree
zpe.thermalcorrgfe: 0.243871 hartree
zpe.sumelectzpe: -747.877642 hartree
zpe.sumelectthermal: -747.859224 hartree
zpe.sumelectthermalent: -747.858280 hartree
zpe.sumelectthermalfe: -747.926174 hartree
dipole: 0.7218 -1.6877 -0.0115
dipole: 1.8356
quadrupole: -80.7455 -110.6077 -94.2732
quadrupole: -11.9839 -3.0183 1.7159
quadrupole: 14.4633 -15.3989 0.9356 -11.9839 -3.0183 1.7159
hfenergy: -748.1700442 hartree
pointgroup: C01 [X(C12H19N1O3)]
dipole: -0.2772696 -0.666637 -0.0164149 debye
polarizability: 221.3870105|-2.7834086|145.3828938|-10.9975901|-1.8874326|101.6670861 unknown
InChI: InChI=1S/C12H19NO3/c1-4-6-7-13-9(3)10(8-11(13)14)12(15)16-5-2/h4-8H2,1-3H3
charge 0 multiplicity 1
35 atoms
O  -1.340946 2.664105 0.451258
O  3.342239 0.206625 -0.283055
O  2.56311 -1.978732 0.02789
N  -1.172646 0.30568 0.600923
C  -2.605392 0.06813 0.846249
C  -0.158218 -0.674249 0.472004
C  0.843939 1.440485 0.127972
C  -3.419294 -0.130396 -0.454475
C  1.052655 -0.060501 0.191903
C  -0.652646 1.612457 0.399475
C  -4.919609 -0.359949 -0.16395
C  -0.463904 -2.131607 0.654951
C  2.32736 -0.736369 -0.01259
C  -5.747919 -0.554089 -1.451902
C  4.699979 -0.361643 -0.52023
C  5.637638 0.819161 -0.753442
H  -2.716476 -0.808637 1.509969
H  -2.986624 0.956836 1.381871
H  1.435726 1.991514 0.881065
H  1.110935 1.875291 -0.851894
H  -3.015149 -0.991186 -1.024075
H  -3.295466 0.766041 -1.091763
H  -5.317281 0.504535 0.405128
H  -5.038581 -1.248123 0.490485
H  -1.264528 -2.464416 -0.031468
H  -0.807495 -2.337927 1.686845
H  0.446479 -2.71871 0.46355
H  -5.390532 -1.428688 -2.027361
H  -6.816887 -0.714999 -1.222127
H  -5.673038 0.332896 -2.108139
H  4.988451 -0.963559 0.360853
H  4.648934 -1.039485 -1.392016
H  6.664252 0.452601 -0.93681
H  5.318592 1.410205 -1.629181
H  5.658645 1.485402 0.12609
