program: Gaussian 09
title: 000245366
version: EM64L-G09RevD.01
frameworkgroup: C1[X(C12H19NO3)]
method: RPBEPBE
basis: SDD
operation: Freq
keyword: #p
keyword: freq=noraman
keyword: PBEPBE/SDD
title: #p freq=noraman PBEPBE/SDD
converged: YES YES NO NO
title: Mulliken charges:
elementType: O O O N C C C C C C C C C C C C H H H H H H H H H H H H H H H H H H H
charge: -0.239410 -0.312236 -0.267173 -0.210978 -0.387548 0.320924 -0.524755 -0.508384 0.087221 -0.347299 0.169227 -0.341314 -0.841190 0.139534 -0.696250 -0.497680 0.257943 0.223982 0.231147 0.277505 0.240455 0.253132 0.225576 0.192435 0.191113 0.206361 0.234261 0.238008 0.326994 0.217364 0.219116 0.210362 0.225297 0.242940 0.243320
chargesum: 0.00000
title: Mulliken charges with hydrogens summed into heavy atoms:
elementType: O O O N C C C C C C C C C C C C
charge: -0.239410 -0.312236 -0.267173 -0.210978 0.094377 0.320924 -0.016103 -0.014797 0.087221 0.070712 0.169227 0.056159 -0.041927 0.139534 -0.049408 0.213877
polarizability: 2.04801243e+02 -1.28076956e+01 1.50145341e+02 1.51826354e+01 8.50380433e+00 1.10026820e+02
1716.lowfreq: -4.2014 -0.0004 0.0002 0.0005 2.9598 6.0754 24.2857 37.8885 48.0442
frequency: 23.8971 37.6696 47.9550 65.2535 73.6226 110.7254 122.0404 136.6933 139.0612 163.6548 187.7322 207.8471 226.8806 240.7042 288.1996 309.7172 318.9397 335.3313 374.2952 411.5075 430.0202 444.7611 455.7380 518.0785 568.3786 604.4727 616.5252 669.3243 701.5168 726.3876 735.7948 770.6538 799.6068 858.3758 896.6783 902.9601 919.0886 968.1201 995.9020 1020.6292 1040.4702 1047.2117 1048.9566 1074.0804 1101.3758 1110.6614 1114.1897 1134.4258 1143.6110 1144.1916 1160.1699 1191.7305 1221.0629 1267.8579 1269.0115 1280.7890 1287.6730 1291.4878 1317.2420 1333.3652 1348.6571 1360.7780 1378.4367 1394.9198 1400.9600 1421.9077 1447.0009 1448.1554 1450.0671 1466.2530 1468.7657 1469.6943 1473.5733 1479.7046 1482.1364 1489.2108 1495.4573 1572.9891 1611.0220 1616.3198 2966.1124 2970.7694 2976.0417 2980.7265 2983.2122 2988.3359 3003.4675 3011.1746 3037.1613 3042.7287 3056.1181 3072.7987 3076.2043 3086.4380 3090.9299 3097.9066 3106.0918 3141.3464 3151.8037
redmass: 4.6365 5.0809 3.6205 4.5967 1.5506 2.7743 1.3808 2.2281 2.7309 3.1700 2.9219 2.1194 1.2899 1.1042 4.0453 4.3881 4.4133 3.5075 3.7856 2.5959 3.5478 4.1586 3.4977 4.3760 3.7399 3.9938 3.9637 4.5613 4.8659 5.8016 1.0928 1.9238 1.6437 2.0239 3.8566 1.7418 1.7001 2.0894 2.9812 3.4790 2.4010 1.6127 1.6058 2.5300 3.7674 1.2583 2.3616 3.5774 1.5078 1.7554 1.3751 1.8797 1.5271 1.6476 1.5299 1.9122 1.7561 1.4160 1.6417 1.5260 1.5409 1.9906 1.4337 1.2172 1.2010 1.2099 1.0959 1.0513 1.0900 1.0592 1.0722 1.0913 1.0727 1.0506 1.0739 1.0916 1.0501 7.4506 9.2020 6.5423 1.0594 1.0707 1.0371 1.0605 1.0415 1.0657 1.0291 1.0979 1.0603 1.1009 1.0963 1.1005 1.0996 1.0913 1.0950 1.1044 1.1045 1.1050 1.0946
irintensity: 0.3492 0.0635 0.5867 2.4688 0.0097 1.4107 2.8486 4.6625 3.0723 2.4748 2.9956 0.9206 0.5989 0.0154 5.9399 0.6997 9.3963 5.5762 12.1457 5.6662 7.3543 3.1842 1.4131 10.0081 0.3839 6.5358 2.7043 19.3582 6.2343 5.6907 11.4933 4.3119 13.3568 15.5480 11.9922 4.4014 10.5638 8.0901 85.7775 7.8415 106.9787 5.7782 3.2036 1.4796 169.3793 0.0583 17.7430 4.0137 88.7756 19.5985 60.4253 176.0531 4.0310 4.1585 0.4490 150.7804 77.3372 72.5204 1.5095 56.4258 4.1319 142.0258 56.0223 11.6303 24.6225 51.9482 23.5101 11.9816 10.8911 12.7001 0.5771 18.2923 3.5318 10.6095 6.8075 22.4169 18.4660 190.7638 191.1257 385.7392 27.1845 15.5764 30.2425 33.4833 30.3349 22.9403 45.8013 4.9522 37.7376 21.0546 14.2643 64.0741 50.9497 5.4984 11.0083 15.0887 26.4131 17.7002 4.3254
temp: 298.150 k
press: 1.00000 atm
elementType: 8 8 8 7 6 6 6 6 6 6 6 6 6 6 6 6 1 1 1 1 1 1 1 1 1 1 1 1 1 1 1 1 1 1 1
symmnumber: 1
zpe: 772307.2 jmol-1
zpe.correction: 0.294156 hartree
zpe.thermalcorrener: 0.311881 hartree
zpe.thermalcorrenthalpy: 0.312825 hartree
zpe.thermalcorrgfe: 0.247117 hartree
zpe.sumelectzpe: -747.861117 hartree
zpe.sumelectthermal: -747.843392 hartree
zpe.sumelectthermalent: -747.842448 hartree
zpe.sumelectthermalfe: -747.908156 hartree
dipole: -0.1524 -3.6664 -1.3903
dipole: 3.9241
quadrupole: -99.8842 -97.7198 -96.4516
quadrupole: 2.1058 -5.0684 1.7151
quadrupole: -1.8656 0.2987 1.5669 2.1058 -5.0684 1.7151
hfenergy: -748.1552729 hartree
pointgroup: C01 [X(C12H19N1O3)]
dipole: 0.0696525 -1.4427054 0.5452184 debye
polarizability: 203.4109888|13.9235537|150.6483176|17.9756775|-7.7439751|110.9140969 unknown
InChI: InChI=1S/C12H19NO3/c1-4-5-8-13-9(2)10(12(15)16-3)6-7-11(13)14/h4-8H2,1-3H3
charge 0 multiplicity 1
35 atoms
O  1.897959 2.663146 0.339997
O  -2.962617 -1.631833 0.135871
O  -3.682399 0.12362 -1.195874
N  0.8136 0.597932 0.528943
C  2.128349 -0.010768 0.883806
C  -0.372175 -0.200729 0.447921
C  -1.347546 1.641437 -0.943267
C  -0.521191 2.602543 -0.075156
C  -1.465821 0.282296 -0.25935
C  2.820432 -0.671602 -0.32965
C  0.828003 1.994111 0.263434
C  4.183842 -1.290604 0.053312
C  -0.299753 -1.529301 1.170248
C  -2.767253 -0.379523 -0.484034
C  4.890646 -1.95327 -1.148696
C  -4.279997 -2.256772 -0.126302
H  2.76058 0.811084 1.259459
H  1.992029 -0.740939 1.698291
H  -0.866963 1.521584 -1.936586
H  -2.354364 2.044587 -1.133822
H  -1.057417 2.814842 0.872168
H  -0.33726 3.566388 -0.576365
H  2.96798 0.093717 -1.115837
H  2.165632 -1.455268 -0.761879
H  4.037764 -2.04205 0.856688
H  4.836215 -0.501149 0.477672
H  -0.057314 -1.376445 2.238977
H  0.48493 -2.179856 0.741734
H  -1.260935 -2.048626 1.094793
H  5.074975 -1.217462 -1.95349
H  5.865037 -2.38455 -0.85539
H  4.273903 -2.76779 -1.572977
H  -4.253399 -3.20512 0.429971
H  -4.414779 -2.43181 -1.206774
H  -5.093492 -1.60572 0.235164
