program: Gaussian 09
title: 000245330
version: EM64L-G09RevD.01
frameworkgroup: C1[X(C3H6ClN5)]
method: RPBEPBE
basis: SDD
operation: Freq
keyword: #p
keyword: freq=noraman
keyword: PBEPBE/SDD
title: #p freq=noraman PBEPBE/SDD
converged: YES YES NO NO
title: Mulliken charges:
elementType: Cl N N N N N C C C H H H H H H
charge: -0.036587 -0.202792 -0.047610 -0.162729 -0.614111 -0.082464 -0.338697 -0.560406 0.280817 0.282688 0.225607 0.297803 0.268740 0.333999 0.355741
chargesum: 0.00000
title: Mulliken charges with hydrogens summed into heavy atoms:
elementType: Cl N N N N N C C C
charge: -0.036587 -0.202792 -0.047610 -0.162729 0.075629 -0.082464 0.169599 0.006137 0.280817
polarizability: 9.90243349e+01 2.36110259e+00 7.58585752e+01 9.67416620e+00 -1.51613024e-01 4.40592630e+01
1716.lowfreq: -0.0009 -0.0006 -0.0004 6.0413 6.2341 10.4999 39.8040 77.9580 82.3872
frequency: 39.5545 77.8711 82.3862 222.7231 246.0609 258.7849 273.1288 356.1205 417.2211 478.8863 639.5623 657.9964 696.0776 722.4719 755.6624 771.1893 871.2764 946.6721 982.2875 1026.4769 1040.5429 1051.2528 1137.8899 1210.2485 1240.9498 1263.4665 1305.3662 1355.9060 1407.2317 1458.2861 1470.5304 1584.3143 1636.9180 3021.3329 3066.0605 3101.4669 3155.2906 3568.5261 3709.1700
redmass: 4.5197 2.7515 6.4291 5.3076 1.5067 4.7286 2.5574 3.9096 3.4007 1.2099 10.5889 6.5476 9.6583 6.4913 4.6347 1.3008 3.7452 8.3633 2.1839 1.8033 3.5382 3.5315 3.7648 2.2440 3.0066 1.1673 1.2214 1.3252 4.8453 1.0849 1.0987 2.0229 1.9506 1.0649 1.0578 1.0995 1.1117 1.0452 1.1052
irintensity: 5.6480 3.9423 12.6696 0.6552 38.4470 27.9015 12.8705 42.7289 4.9770 214.3610 3.1370 43.8954 6.0146 6.3750 10.1940 9.9089 22.8826 18.8098 3.4542 5.5801 21.0003 12.1634 6.0008 7.4679 0.7308 10.9329 1.9575 2.1151 81.4135 3.9708 22.4691 34.2583 310.6116 15.4055 13.0208 1.2142 5.6625 82.4931 52.8667
temp: 298.150 k
press: 1.00000 atm
elementType: 17 7 7 7 7 7 6 6 6 1 1 1 1 1 1
symmnumber: 1
zpe: 282959.7 jmol-1
zpe.correction: 0.107774 hartree
zpe.thermalcorrener: 0.116862 hartree
zpe.thermalcorrenthalpy: 0.117806 hartree
zpe.thermalcorrgfe: 0.072051 hartree
zpe.sumelectzpe: -850.991464 hartree
zpe.sumelectthermal: -850.982376 hartree
zpe.sumelectthermalent: -850.981432 hartree
zpe.sumelectthermalfe: -851.027187 hartree
dipole: 3.0655 5.0482 0.8752
dipole: 5.9706
quadrupole: -82.4925 -55.3968 -58.7620
quadrupole: -9.7324 -1.9412 0.6783
quadrupole: -16.9421 10.1536 6.7885 -9.7324 -1.9412 0.6783
hfenergy: -851.0992379 hartree
pointgroup: C01 [X(C3H6Cl1N5)]
dipole: -1.2807552 1.9358578 -0.3605513 debye
dipolederiv: -0.6371778 -0.011114 -0.0138674 0.0383146 -0.1522697 0.0043271 -0.0532717 0.0043114 -0.1882747 -0.847992 -0.1161276 -0.0800067 0.2873863 -0.3543317 0.0771143 -0.0424721 -0.0526303 -0.1537603 0.1126051 -0.4197858 0.0204282 -0.5624275 -0.1103226 -0.1058023 0.0661788 -0.1035715 -0.10101 -0.3219899 0.4108649 0.0108525 -0.0806316 -0.7095108 -0.0575375 -0.0455957 0.1195759 -0.2122016 -0.2635823 0.2285373 0.1559903 0.0204642 -1.2264528 0.0162492 0.1756291 0.0096182 -0.6535347 -0.2440564 0.1851956 0.0350893 0.0928363 0.3816398 0.0621372 -0.021733 0.0647621 -0.1729946 0.5667719 0.0551006 0.0283124 0.0062777 0.1357199 -0.0409582 -0.0801401 -0.0042227 0.2219006 0.7481544 -0.0082081 0.0703776 -0.0284627 0.1667514 0.0137915 0.1001772 -0.0034989 0.12627 0.4963567 -0.3315505 0.0185013 0.1866677 1.3959218 0.0097573 0.0742995 -0.0779497 0.2399374 0.0421557 -0.003432 -0.0086387 -0.0404291 0.0314106 -0.0839928 0.0003368 -0.0465954 0.0476311 -0.0085473 -0.011587 -0.0084748 0.0335423 -0.047972 0.1242142 0.0051634 0.0681343 0.0389012 -0.0083372 0.0418178 -0.0366061 0.007632 -0.000809 0.0776145 -0.0090837 0.0467313 0.049079 -0.0292531 -0.0381575 -0.0583484 -0.016172 -0.008655 -0.0956018 -0.0203086 -0.0594114 0.0128453 0.1782203 -0.0302953 -0.0758048 0.0094332 0.2325347 -0.0116885 -0.0944063 0.0071254 0.3575353 0.2166719 0.0487414 -0.0578048 0.0455686 0.2663457 0.0103758 -0.0547736 0.0276213 0.387676 unknown
polarizability: 99.2552933|-1.3827782|75.722653|9.4253754|0.1570693|43.9642269 unknown
InChI: InChI=1S/C3H6ClN5/c4-1-2-9-3(5)6-7-8-9/h1-2,5H2
charge 0 multiplicity 1
15 atoms
Cl -3.92842 -0.046065 0.087249
N  0.171436 -0.190279 -0.311381
N  0.848319 -1.445602 -0.144247
N  2.268787 0.271073 0.321287
N  0.792257 2.162404 -0.045196
N  2.091867 -1.12487 0.230544
C  -1.248885 -0.155088 -0.662247
C  -2.125258 -0.192246 0.603255
C  1.060067 0.818915 -0.015054
H  -1.463345 -1.029534 -1.296922
H  -1.465336 0.751589 -1.256819
H  -2.026115 -1.148313 1.135696
H  -1.930296 0.652468 1.280585
H  -0.09403 2.542233 -0.36309
H  1.554152 2.796816 0.17954
