program: Gaussian 09
title: 000245328
version: EM64L-G09RevD.01
frameworkgroup: C1[X(C9H11ClO3S)]
method: RPBEPBE
basis: SDD
operation: Freq
keyword: #p
keyword: freq=noraman
keyword: PBEPBE/SDD
title: #p freq=noraman PBEPBE/SDD
converged: YES YES NO NO
title: Mulliken charges:
elementType: Cl S O O O C C C C C C C C C H H H H H H H H H H H
charge: -0.077016 1.029895 -0.391425 -0.528326 -0.504946 -0.776413 0.515109 -0.344470 -0.344081 -0.248906 -0.213363 -0.213432 -0.221688 -0.527578 0.302557 0.291293 0.249641 0.247779 0.231880 0.273986 0.236439 0.236435 0.237235 0.258960 0.280436
chargesum: 0.00000
title: Mulliken charges with hydrogens summed into heavy atoms:
elementType: Cl S O O O C C C C C C C C C
charge: -0.077016 1.029895 -0.391425 -0.528326 -0.504946 -0.182564 0.515109 -0.094828 -0.096302 0.256960 0.023076 0.023003 0.015547 0.011818
polarizability: 2.25794927e+02 -1.56107732e+01 1.30776424e+02 -6.88574744e-01 -1.67201857e+01 1.01339250e+02
1716.lowfreq: -13.6820 -7.8715 -4.4807 0.0020 0.0024 0.0024 11.4517 29.7130 40.9078
frequency: 5.3792 29.4760 40.8370 56.5626 69.6648 102.7671 138.3636 165.4022 176.9176 184.7489 250.0004 272.2946 329.4476 341.9414 385.6304 400.2924 402.7262 457.9624 501.1077 519.0512 570.7434 600.5225 614.4128 693.4398 773.7456 813.5302 824.4418 837.3243 849.8862 883.4140 923.4747 934.3664 967.0029 978.6364 982.5341 989.2996 1004.0295 1025.5703 1062.7531 1084.5365 1132.5784 1169.5029 1177.7050 1192.1305 1218.2923 1223.1762 1238.0404 1293.8261 1331.4960 1354.2759 1389.9091 1430.8450 1433.7111 1442.6952 1443.6295 1484.1524 1586.7588 1609.2235 2954.9434 3014.1042 3059.2301 3061.6872 3132.1154 3136.1145 3145.4932 3146.2533 3154.5430 3158.3228 3171.7970
redmass: 5.5994 4.9889 5.9130 6.7026 8.4888 5.6978 6.5094 6.9346 6.5782 6.7460 4.5662 4.7110 5.8520 2.1612 3.9062 2.8769 3.8498 8.2636 5.7192 4.9667 4.3926 4.7694 6.3043 1.7109 1.9357 4.0970 2.6216 9.9942 1.2544 1.9336 2.1764 1.4278 4.2534 2.0339 1.4002 6.0842 1.3418 2.1963 2.4213 1.5633 1.1288 1.2350 1.0548 1.1159 1.1458 1.1421 2.7840 1.1661 1.2766 1.2476 8.7510 1.1241 1.1496 1.0704 2.1992 2.3259 5.8526 5.9310 1.0568 1.1033 1.0585 1.0583 1.0855 1.0887 1.0928 1.1100 1.1123 1.0971 1.1018
irintensity: 0.5742 1.2253 2.6153 2.6903 4.2794 1.9806 3.5861 1.4963 20.5218 9.7548 1.2888 1.5285 33.7727 1.6057 3.8127 2.7278 49.1102 31.9941 123.7235 11.7184 9.6026 35.4485 0.0089 49.9284 27.2988 2.6211 44.1905 62.0472 0.2082 14.7125 36.5686 2.2339 55.3248 49.0179 0.0867 0.8799 0.0692 2.5805 19.2983 19.0821 2.8948 8.5224 0.0641 8.7384 4.6320 25.7544 47.2133 9.7862 0.8661 20.3307 1.5706 15.0114 0.9417 19.9461 14.2602 2.1301 0.4250 15.8700 43.3184 4.9266 29.3811 2.7840 0.9707 0.0234 10.1912 7.1108 9.8499 20.2989 21.1500
temp: 298.150 k
press: 1.00000 atm
elementType: 17 16 8 8 8 6 6 6 6 6 6 6 6 6 1 1 1 1 1 1 1 1 1 1 1
symmnumber: 1
zpe: 481681.1 jmol-1
zpe.correction: 0.183463 hartree
zpe.thermalcorrener: 0.198702 hartree
zpe.thermalcorrenthalpy: 0.199646 hartree
zpe.thermalcorrgfe: 0.136672 hartree
zpe.sumelectzpe: -1432.120433 hartree
zpe.sumelectthermal: -1432.105194 hartree
zpe.sumelectthermalent: -1432.104250 hartree
zpe.sumelectthermalfe: -1432.167224 hartree
dipole: 0.5320 -2.5684 -1.6930
dipole: 3.1218
quadrupole: -67.2147 -109.0490 -99.7577
quadrupole: -4.1289 -1.0869 -5.0560
quadrupole: 24.7925 -17.0419 -7.7506 -4.1289 -1.0869 -5.0560
hfenergy: -1432.3038959 hartree
pointgroup: C01 [X(C9H11Cl1O3S1)]
dipole: -0.2103621 0.7886502 -0.9177793 debye
dipolederiv: -0.3330118 0.1544969 -0.0680366 0.0149371 -0.4358655 0.1263939 0.00656 0.0997591 -0.2157465 1.5768057 0.2051721 -0.0936514 0.1118216 1.1062832 -0.0204767 -0.1024541 -0.1104612 1.1200495 -1.4120123 -0.0976115 0.0972517 -0.2310731 -0.4194062 0.0233612 -0.0138486 -0.0080683 -0.4053316 -0.5920983 -0.0249486 -0.0305721 0.034636 -0.4836025 -0.089805 -0.2410759 0.0296872 -0.6595227 -0.5242899 -0.093877 0.0157062 0.059627 -0.7101318 0.1149039 -0.2018619 0.0990279 -0.4897267 0.8267518 -0.2965987 0.1337817 -0.4511981 0.1199774 -0.0794355 0.3711654 -0.0983289 0.1350887 -0.3983267 0.0911064 0.0034004 0.0719626 -0.0567033 0.0368107 0.067096 0.0108686 -0.1159718 0.1051862 0.0960505 0.0170897 -0.1427077 0.0050518 0.0117235 -0.0843438 0.0535557 -0.0939569 0.1168605 -0.1312164 -0.0580133 0.1160036 -0.0001989 0.0897107 0.0322146 0.0379336 -0.0681562 0.6745264 0.1881304 -0.0427058 0.4571911 0.1774488 -0.0120984 0.3723126 0.046694 0.0533373 -0.2476796 -0.071649 -0.0703441 -0.1540491 0.0966547 0.0852137 -0.0352775 0.1167527 -0.072949 -0.047934 0.1905896 0.0499731 0.2431345 -0.0563154 0.0516062 0.1175211 -0.0033488 -0.1109556 0.1193776 -0.0040128 -0.0609623 -0.0112765 -0.0009069 0.0677591 -0.0497485 0.0654039 -0.0928441 0.1583716 -0.294676 0.1067665 -0.1761767 0.4822292 -0.103316 -0.0466285 -0.1112604 0.2326183 0.078525 0.0516189 -0.0242859 0.0375099 0.0277927 0.0201415 -0.0915058 0.0313781 0.0468989 0.0213281 0.0196522 -0.0286968 0.1019569 0.0103304 -0.0239262 -0.047164 -0.0055843 0.0112323 0.0071018 -0.0912757 -0.0122975 -0.0656606 0.05236 -0.033781 -0.0313614 -0.0290608 0.113067 0.0831075 0.0547631 0.0462961 0.0422343 -0.0093905 -0.072139 0.0161073 -0.0570612 0.0977842 -0.2236774 0.0118861 -0.043996 0.0096322 -0.0359645 0.072373 -0.0630817 0.0698517 0.081644 0.1104859 0.0091855 0.0860861 -0.0645609 0.0708944 -0.0447536 -0.0334053 -0.0458408 0.0324108 0.0599685 0.0382532 0.021804 0.0583571 -0.0450953 -0.0922474 0.0474203 -0.101914 0.1108417 -0.0315563 -0.0813097 -0.0282833 -0.1107904 0.0190517 -0.056922 -0.019067 -0.0541591 0.1352207 -0.1040236 0.0378414 0.0439789 0.0405752 0.0954856 -0.0303069 0.0416496 -0.0295265 0.1334706 -0.1001375 -0.0302519 -0.0620723 -0.0843008 -0.0032381 0.0069315 -0.0651093 -0.0027226 0.0609571 0.0763509 0.0686808 0.0017827 0.0922147 -0.0067409 -0.047721 0.0538864 -0.0035755 -0.0394601 unknown
polarizability: 226.1129654|-13.4580745|136.870905|6.5033752|6.4925531|94.9267315 unknown
InChI: InChI=1S/C9H11ClO3S/c10-6-7-13-14(11,12)8-9-4-2-1-3-5-9/h1-5H,6-8H2
charge 0 multiplicity 1
25 atoms
Cl 3.117985 1.853474 -0.745859
S  0.87225 -1.199375 0.652456
O  2.611987 -1.354093 -0.158968
O  1.031139 -0.240683 1.954805
O  0.294741 -2.697358 0.808424
C  -0.032351 -0.236558 -0.884474
C  -1.448796 0.040945 -0.558501
C  -1.810724 1.264759 0.071112
C  -2.45892 -0.913463 -0.863992
C  3.65279 -0.608705 0.555596
C  -3.160912 1.534719 0.372302
C  -3.807917 -0.640105 -0.560821
C  -4.161353 0.584413 0.055572
C  4.299157 0.419947 -0.363856
H  0.639034 0.631101 -0.964683
H  0.149511 -0.978489 -1.675851
H  -1.032254 1.993285 0.324755
H  -2.180452 -1.865964 -1.329263
H  4.424698 -1.339897 0.873437
H  3.232591 -0.128096 1.464209
H  -3.435201 2.478445 0.855245
H  -4.581855 -1.377472 -0.798348
H  -5.210215 0.794954 0.291962
H  5.176698 0.886995 0.110822
H  4.559371 -0.005376 -1.343682
