program: Gaussian 09
title: 000245341
version: EM64L-G09RevD.01
frameworkgroup: C1[X(C21H16O3)]
method: RPBEPBE
basis: SDD
operation: Freq
keyword: #pfreq=noraman
keyword: PBEPBE/SDD
title: #p freq=noraman PBEPBE/SDD
converged: YES YES NO NO
title: Mulliken charges:
elementType: O O O C C C C C C C C C C C C C C C C C C C C C H H H H H H H H H H H H H H H H
charge: -0.194564 -0.165374 -0.165373 0.224739 0.224889 -0.365335 -0.365437 -0.738016 -0.277265 -0.277377 0.369439 0.369328 0.181316 0.181356 -0.413432 -0.413518 -0.367478 -0.367478 -0.246788 -0.246730 -0.259028 -0.259044 -0.237103 -0.237131 0.318058 0.318042 0.296633 0.233794 0.265348 0.265380 0.237269 0.237288 0.246841 0.246906 0.226730 0.226728 0.231326 0.231336 0.231861 0.231863
chargesum: 0.00000
title: Mulliken charges with hydrogens summed into heavy atoms:
elementType: O O O C C C C C C C C C C C C C C C C C C C C C
charge: -0.194564 -0.165374 -0.165373 0.224739 0.224889 -0.047277 -0.047395 -0.207589 -0.011917 -0.011997 0.369439 0.369328 0.181316 0.181356 -0.176163 -0.176230 -0.120636 -0.120572 -0.020058 -0.020002 -0.027702 -0.027708 -0.005243 -0.005268
polarizability: 3.16356385e+02 8.59719097e-03 2.06509382e+02 -1.11082241e-02 2.74857946e+01 1.32544174e+02
1716.lowfreq: -8.4197 -0.0001 0.0003 0.0007 6.3684 8.7572 21.2854 32.5451 33.7873
frequency: 20.8814 32.4841 33.2558 57.4944 76.1795 91.2444 131.3835 145.9618 159.5165 203.9080 228.5081 245.8008 258.8321 290.4195 320.9367 367.7299 401.4879 402.0712 422.7103 445.9389 457.5801 473.9619 505.7629 514.7978 528.9345 575.3150 613.6043 615.6592 620.0197 621.6601 653.9483 667.9031 683.0286 702.4826 703.7347 722.7313 735.5322 759.0838 770.3911 770.5758 815.1087 836.5110 847.0061 848.8746 849.0930 885.8444 890.6206 919.9209 922.5335 931.1658 972.5559 973.4379 975.1105 978.1132 991.2839 992.3063 997.0581 997.3711 1004.9905 1024.8964 1030.9657 1037.3599 1038.3460 1055.5164 1064.1308 1086.5383 1105.9618 1130.8206 1134.0098 1143.5692 1174.6404 1175.0053 1196.9963 1198.1830 1200.7309 1204.3960 1224.2398 1246.6350 1265.6245 1275.3898 1310.4661 1326.4133 1328.1374 1338.1847 1376.6933 1376.7786 1435.7628 1436.6204 1470.1510 1489.9770 1491.1985 1581.2195 1589.1301 1594.0877 1616.3591 1617.1024 1690.2905 1756.1627 3001.8435 3050.9710 3064.3119 3086.9057 3124.6171 3124.7532 3133.1502 3133.3014 3144.8508 3145.0454 3154.7922 3155.0320 3165.5818 3167.6728 3167.9706 3196.6423
redmass: 4.3266 8.7077 4.2267 4.8974 4.8369 5.6845 15.0898 5.8427 6.4291 4.9390 6.1929 4.4877 6.0404 4.1600 4.5165 9.1219 2.7944 2.8125 4.0079 3.9314 2.4254 4.5252 3.5469 3.7228 4.5339 12.2037 4.5986 6.4144 4.5681 3.9636 6.3727 5.9018 5.7726 1.6669 1.7046 5.4239 2.2329 2.8328 2.1916 2.0241 7.7358 5.5962 3.1924 1.3155 1.2526 3.2223 2.9213 1.5248 1.5666 1.5051 1.6750 1.8489 2.5547 2.3263 5.2706 5.1108 1.3536 1.3567 1.7840 2.3302 2.3593 3.6010 2.0304 2.0729 2.3575 1.4257 2.0136 1.7253 7.6707 1.2964 1.0551 1.0523 1.9435 1.1555 1.1241 1.3242 1.4728 1.4670 1.8368 1.6352 3.9506 1.4179 1.3701 2.1327 7.0986 6.6956 2.2598 2.2711 1.1052 2.3148 2.3532 6.4336 5.9487 6.2424 6.0052 5.9828 12.9285 12.8279 1.0612 1.0849 1.0866 1.1036 1.0847 1.0847 1.0876 1.0877 1.0927 1.0927 1.0957 1.0958 1.0894 1.1012 1.0990 1.1088
irintensity: 0.0106 0.2516 0.2056 0.1435 0.1483 0.6287 3.7788 2.8758 4.3005 2.0653 0.1350 2.7334 0.2548 0.5582 0.0005 9.2022 0.9615 0.5740 0.4052 1.8408 4.4384 0.0353 6.1738 21.8005 7.6481 1.9879 0.0218 0.8853 50.7642 0.0837 0.8457 0.0738 0.2813 0.0693 99.5435 20.6423 87.9827 9.9438 61.4550 1.0801 220.2626 3.0896 73.3791 6.6487 0.1292 21.3594 11.6745 0.5306 1.3468 0.1425 3.0402 2.0067 1.1846 7.4463 1.8119 0.2415 0.2028 0.8941 11.0705 47.0213 60.2260 91.2584 3.6343 32.7339 0.1213 3.5648 0.2090 44.1283 112.0233 0.5517 0.3842 0.2006 6.3431 3.3535 0.2900 1.4725 3.5082 1.0785 10.0545 0.0106 12.3267 4.0463 3.0141 34.7972 0.2604 1.1097 2.0475 15.9394 1.6359 36.1859 3.0778 1.0825 0.6774 3.8005 13.4007 0.6686 446.1577 103.8772 19.8071 4.5237 2.2359 14.0536 5.8939 0.7942 1.2419 2.8994 48.7752 11.9294 6.1893 47.1981 3.0633 1.9648 24.6781 3.7833
temp: 298.150 k
press: 1.00000 atm
elementType: 8 8 8 6 6 6 6 6 6 6 6 6 6 6 6 6 6 6 6 6 6 6 6 6 1 1 1 1 1 1 1 1 1 1 1 1 1 1 1 1
symmnumber: 1
zpe: 810580.6 jmol-1
zpe.correction: 0.308734 hartree
zpe.thermalcorrener: 0.327391 hartree
zpe.thermalcorrenthalpy: 0.328335 hartree
zpe.thermalcorrgfe: 0.260268 hartree
zpe.sumelectzpe: -1033.831951 hartree
zpe.sumelectthermal: -1033.813293 hartree
zpe.sumelectthermalent: -1033.812349 hartree
zpe.sumelectthermalfe: -1033.880417 hartree
dipole: 0.0006 -5.4442 -0.8048
dipole: 5.5033
quadrupole: -130.8973 -152.3115 -134.6830
quadrupole: 0.0026 -0.0081 7.6989
quadrupole: 8.4000 -13.0142 4.6142 0.0026 -0.0081 7.6989
hfenergy: -1034.1406844 hartree
pointgroup: C01 [X(C21H16O3)]
dipole: -0.0126495 -2.1609122 -0.1352178 debye
polarizability: 316.3527262|-0.5944622|214.4913928|-0.2494172|-10.0822417|124.5658224 unknown
InChI: InChI=1S/C21H16O3/c22-18-16-17(19(23)24-18)21(15-9-5-2-6-10-15)12-11-20(16,13-21)14-7-3-1-4-8-14/h1-12,16-17H,13H2
charge 0 multiplicity 1
40 atoms
O  0.018632 3.006118 1.058133
O  2.325307 2.684976 1.113142
O  -2.291498 2.711831 1.116674
C  1.162103 -0.183407 -0.087459
C  -1.163022 -0.170529 -0.085793
C  0.781048 0.712897 1.204761
C  -0.770114 0.721887 1.205761
C  -0.00615 -1.214046 0.026571
C  0.683662 0.625023 -1.30598
C  -0.677524 0.632482 -1.305038
C  2.587451 -0.706093 -0.111996
C  -2.594172 -0.677133 -0.107552
C  1.201663 2.175516 1.126889
C  -1.173873 2.189261 1.128387
C  2.873183 -2.061487 0.19364
C  -2.894891 -2.029322 0.198012
C  3.667882 0.157245 -0.435625
C  -3.665322 0.19877 -0.428289
C  4.201105 -2.544431 0.17977
C  -4.228379 -2.496794 0.187002
C  4.994527 -0.323211 -0.45008
C  -4.997466 -0.266223 -0.439894
C  5.26813 -1.676213 -0.142332
C  -5.286042 -1.616098 -0.132128
H  1.232818 0.248736 2.097246
H  -1.226177 0.262995 2.098786
H  -0.010658 -1.923315 -0.818154
H  -0.008499 -1.767666 0.984392
H  1.352452 1.14425 -1.99616
H  -1.341458 1.159099 -1.99431
H  2.057679 -2.751507 0.436325
H  -2.086933 -2.729057 0.438236
H  3.479528 1.213273 -0.654893
H  -3.465405 1.252706 -0.647403
H  4.400527 -3.595732 0.416051
H  -4.43941 -3.545837 0.423241
H  5.8148 0.359919 -0.69642
H  -5.810325 0.426527 -0.683925
H  6.298684 -2.047953 -0.154263
H  -6.320865 -1.975858 -0.141726
