program: Gaussian 09
title: 000245297
version: EM64L-G09RevD.01
frameworkgroup: C1[X(C7H8N2O2)]
method: RPBEPBE
basis: SDD
operation: Freq
keyword: #pfreq=noraman
keyword: PBEPBE/SDD
title: #p freq=noraman PBEPBE/SDD
converged: YES YES NO NO
title: Mulliken charges:
elementType: O O N N C C C C C C C H H H H H H H H
charge: -0.352504 -0.384785 -0.685471 -0.342451 0.318084 0.500970 -0.347436 -0.342877 -0.405038 -0.413816 0.197231 0.271783 0.217698 0.222834 0.220751 0.310430 0.312063 0.325370 0.377163
chargesum: 0.00000
title: Mulliken charges with hydrogens summed into heavy atoms:
elementType: O O N N C C C C C C C
charge: -0.352504 -0.007622 -0.062978 -0.017080 0.318084 0.500970 -0.075653 -0.125179 -0.182204 -0.193065 0.197231
polarizability: 1.77987160e+02 -3.77366945e-01 9.95660656e+01 -1.10707257e+00 7.09215212e-01 4.06065564e+01
1716.lowfreq: -8.3062 -0.0008 -0.0008 -0.0005 6.0124 8.6882 45.4507 86.1367 133.4490
frequency: 45.4269 86.1252 133.4434 172.3713 261.1539 298.7354 315.3770 349.6108 371.9813 398.8954 408.3668 410.5044 468.3842 510.3378 538.2700 612.0227 634.3698 680.2715 743.6405 811.6796 815.2022 840.3564 868.9740 939.3436 976.6482 979.0698 1001.5749 1019.9570 1117.6240 1133.4533 1191.7386 1249.6272 1310.9019 1324.6147 1364.2076 1384.0992 1441.2363 1474.2549 1513.8020 1556.8238 1583.7535 1633.2959 1646.2631 3115.2408 3126.8437 3139.8471 3162.7608 3166.8003 3562.1060 3616.6970 3701.7126
redmass: 4.7499 5.3533 5.8371 6.8876 2.8327 5.0459 5.1734 1.9360 2.7435 1.0816 1.2161 2.6824 4.4657 2.4371 1.2306 6.2870 6.7078 3.3178 3.9953 1.7355 2.8651 1.6740 6.4246 1.3924 5.4552 1.4226 2.8207 1.4509 2.4992 1.2650 1.1282 1.5091 1.3475 2.5179 2.6775 4.1674 4.1723 2.8227 2.6838 3.1461 5.2234 2.9321 1.4903 1.0868 1.0893 1.0966 1.0954 1.0626 1.0451 1.0817 1.1040
irintensity: 7.2767 0.5657 0.1015 11.2059 79.1584 25.7015 12.0074 49.0863 6.3390 108.4029 222.0124 26.8266 9.0990 56.8932 79.5348 12.0103 1.1403 47.9289 10.4554 16.5216 7.3416 61.9187 7.3322 2.2127 111.2946 9.3592 11.0223 2.4550 22.0893 27.0674 44.3288 6.3104 0.5503 20.4261 466.3361 30.2410 31.1674 99.3815 57.4545 5.0644 34.5565 80.3767 369.2611 12.8686 20.4214 19.5698 4.0300 33.6643 106.3943 54.6020 23.8600
temp: 298.150 k
press: 1.00000 atm
elementType: 8 8 7 7 6 6 6 6 6 6 6 1 1 1 1 1 1 1 1
symmnumber: 1
zpe: 378078.5 jmol-1
zpe.correction: 0.144003 hartree
zpe.thermalcorrener: 0.154416 hartree
zpe.thermalcorrenthalpy: 0.155360 hartree
zpe.thermalcorrgfe: 0.107983 hartree
zpe.sumelectzpe: -530.659728 hartree
zpe.sumelectthermal: -530.649314 hartree
zpe.sumelectthermalent: -530.648370 hartree
zpe.sumelectthermalfe: -530.695747 hartree
dipole: -6.2790 -2.4040 0.8641
dipole: 6.7787
quadrupole: -53.4695 -58.3362 -68.9285
quadrupole: -1.9994 1.1236 0.7228
quadrupole: 6.7752 1.9085 -8.6838 -1.9994 1.1236 0.7228
hfenergy: -530.8037303 hartree
pointgroup: C01 [X(C7H8N2O2)]
dipole: 2.4932642 -0.8765785 -0.3576562 debye
dipolederiv: -0.9038342 0.2966904 0.0359626 0.2146294 -0.880357 -0.0869255 -0.0114738 -0.0749325 -0.3958087 -0.9037754 -0.2234687 0.0000695 0.0290357 -0.1649159 0.0085085 -0.0237517 -0.0048371 -0.364975 -1.8006366 0.0389546 0.0375931 0.0602359 -0.1058805 -0.0776617 0.0549265 -0.0788233 -0.7275219 0.0762282 -0.0458325 -0.0308795 -0.610634 -0.6494503 0.056288 0.0668363 0.1432185 -0.3064183 -0.8283292 0.0399399 0.0309714 0.0854482 -0.243692 0.0058253 0.0487134 0.0037203 -0.0475386 1.8545063 -0.0552435 -0.0677902 -0.0429605 0.0350516 0.0150902 -0.0848971 0.0178857 0.1588595 0.4140882 0.1021635 -0.0348117 0.1617504 0.1151131 -0.0367249 -0.0098344 -0.016013 -0.0849281 0.4001971 -0.1549784 -0.0168944 -0.1991502 0.1327634 -0.0435397 -0.0699022 -0.0402628 -0.1133046 -0.5174408 0.0011817 0.0090482 0.5258549 0.0406091 -0.0538806 -0.0497339 -0.0331418 -0.2278033 -0.5840852 0.0609974 0.0071147 -0.4899748 0.0506313 -0.0200642 0.0872568 -0.0471809 -0.2225059 1.5873064 -0.0044637 -0.0189808 0.1184018 1.1395854 0.1429466 0.0073254 0.1121273 0.2190867 0.1100557 0.0728432 -0.0071137 0.0440367 0.013985 0.0193874 -0.0144397 0.0077038 0.1499603 0.0305622 -0.1103108 0.0225629 -0.0906673 -0.0410605 0.0340019 0.0250273 0.0307918 0.1376283 -0.0292596 -0.1074993 0.0209193 -0.094973 -0.0444789 0.0307628 0.0182405 0.0319907 0.1641645 -0.0137881 0.1016003 -0.0063072 0.0956664 -0.061862 0.0304718 0.0020494 0.0320282 0.1647055 0.2281241 -0.0149093 0.0085828 -0.0639977 0.1259496 0.0352481 0.0105536 0.0345345 0.3841964 0.2337311 0.0119718 0.0057439 0.058711 0.1243223 0.0296113 -0.0069476 0.0297635 0.3862063 0.1553319 0.0316445 0.0130935 0.128523 0.2392854 -0.0622708 -0.0275584 -0.1089968 0.3532576 0.4910182 -0.041281 -0.0088844 0.0700642 0.1744007 -0.0270748 -0.0223904 -0.0395761 0.3727392 unknown
polarizability: 177.7977944|2.795727|99.5680614|-3.6190947|-2.611327|40.7939259 unknown
InChI: InChI=1S/C7H8N2O2/c8-6-3-1-5(2-4-6)7(10)9-11/h1-4,9,11H,8H2
charge 0 multiplicity 1
19 atoms
O  -2.421826 1.242627 0.273869
O  -3.983338 -0.819706 -0.041917
N  3.931966 -0.166636 -0.106717
N  -2.555994 -1.008859 -0.027271
C  -0.312389 0.001019 0.063939
C  2.543362 -0.11153 -0.04761
C  0.456732 1.183137 -0.108643
C  0.372486 -1.237537 0.201286
C  1.856679 1.134696 -0.168009
C  1.774013 -1.298933 0.145441
C  -1.787018 0.132438 0.107388
H  -0.076073 2.136033 -0.192296
H  -0.181783 -2.16469 0.391722
H  2.431283 2.058573 -0.30562
H  2.284998 -2.261875 0.265028
H  4.425281 -1.050026 -0.014751
H  4.4816 0.67915 -0.22872
H  -2.291059 -1.915753 -0.405267
H  -4.02522 0.185171 0.116148
