program: Gaussian 09
title: 000245298
version: EM64L-G09RevD.01
frameworkgroup: C1[X(C7H5Br2NO3)]
method: RPBEPBE
basis: SDD
operation: Freq
keyword: #p
keyword: freq=noraman
keyword: PBEPBE/SDD
title: #p freq=noraman PBEPBE/SDD
converged: NO NO NO NO
title: Mulliken charges:
elementType: Br Br O O O N C C C C C C C H H H H H
charge: 0.053566 0.020639 -0.388866 -0.428345 -0.335639 -0.669183 0.112028 0.288479 0.854291 -0.612000 -0.314166 -0.477554 0.169560 0.287585 0.328219 0.324998 0.392641 0.393748
chargesum: 0.00000
title: Mulliken charges with hydrogens summed into heavy atoms:
elementType: Br Br O O O N C C C C C C C
charge: 0.053566 0.020639 0.003775 -0.034597 -0.335639 -0.015967 0.112028 0.288479 0.854291 -0.612000 -0.026581 -0.477554 0.169560
polarizability: 1.74592712e+02 -9.10771361e+00 1.88007404e+02 -5.23073457e-04 -5.06183582e-03 4.46280172e+01
1716.lowfreq: -6.9265 -4.8946 -0.0007 -0.0004 0.0002 3.2457 70.9957 82.5153 113.5411
frequency: 70.9949 82.5144 113.5403 131.1426 139.7687 148.6856 232.9300 272.0688 276.4981 283.2256 328.6501 345.3083 406.5975 438.6924 485.6120 522.2912 545.4275 569.9092 580.9887 606.3294 643.8000 651.5825 721.5097 742.4002 781.1229 794.1483 855.1456 910.7772 994.0294 1039.0161 1083.9763 1154.8606 1222.7195 1283.9282 1337.4938 1380.4829 1405.9575 1451.8020 1491.2244 1534.1584 1577.8120 1620.2367 1648.6925 2964.5202 3183.3922 3517.4494 3535.8305 3661.8228
redmass: 8.5653 8.3258 8.3624 19.5591 15.1708 8.5456 21.5869 9.3063 5.4478 5.9928 7.3878 8.1827 5.6276 6.8767 2.3609 1.1495 1.2736 1.2856 4.7482 5.0804 7.6297 7.3820 8.7606 6.9056 7.4334 8.1892 1.0841 1.4108 2.7555 4.8232 1.9747 2.0359 2.2904 1.8028 3.9461 2.7430 8.1637 4.9240 5.1345 4.2730 3.4536 1.5691 3.7889 1.0703 1.0929 1.0453 1.0642 1.1042
irintensity: 1.7940 0.1061 2.3668 0.3125 0.3686 0.0161 0.0118 0.3593 2.5640 10.4056 0.1877 16.0334 9.8451 0.7810 36.5765 79.7790 142.0225 126.8483 63.9386 27.1928 34.6289 38.0809 0.1769 28.3933 34.0382 25.5328 161.4606 10.7182 25.6082 172.2060 188.4138 280.2859 5.3070 43.1002 124.2299 309.3770 100.3783 204.2085 106.8207 38.3864 67.6331 42.6571 584.2768 325.4821 2.4566 122.3092 81.8226 64.8262
temp: 298.150 k
press: 1.00000 atm
elementType: 35 35 8 8 8 7 6 6 6 6 6 6 6 1 1 1 1 1
symmnumber: 1
zpe: 297697.1 jmol-1
zpe.correction: 0.113387 hartree
zpe.thermalcorrener: 0.125745 hartree
zpe.thermalcorrenthalpy: 0.126689 hartree
zpe.thermalcorrgfe: 0.073025 hartree
zpe.sumelectzpe: -576.176261 hartree
zpe.sumelectthermal: -576.163903 hartree
zpe.sumelectthermalent: -576.162958 hartree
zpe.sumelectthermalfe: -576.216622 hartree
dipole: 2.5684 -0.9531 0.0033
dipole: 2.7395
quadrupole: -101.6956 -72.5556 -96.4651
quadrupole: 1.6825 -0.0060 0.0019
quadrupole: -11.4568 17.6832 -6.2263 1.6825 -0.0060 0.0019
hfenergy: -576.2896477 hartree
pointgroup: C01 [X(C7H5Br2N1O3)]
dipole: 0.6513171 -0.8587185 0.0078997 debye
dipolederiv: -0.1183647 -0.2183368 -0.0045233 -0.1682791 -0.4953565 -0.0074578 -0.0040896 -0.0087273 0.0129002 -0.2498045 0.247763 -0.0037429 0.2660689 -0.5009402 0.0028394 -0.0034818 0.0022531 -0.0154815 -0.7899262 0.4035669 -0.006921 0.4421409 -0.849897 0.0074252 -0.0068693 0.0064688 -0.3741854 -0.7822193 -0.4761364 -0.0118084 -0.8927817 -1.0268079 -0.0248747 -0.0143862 -0.014932 -0.4172863 -1.3171011 0.2253284 -0.0205025 0.4257284 -0.8534236 0.006416 -0.018008 0.0015501 -0.3609258 -1.6021271 -0.0036372 -0.0225205 -0.1296882 -0.2435518 -0.0002254 -0.0234823 0.0026076 -0.6263184 -1.4887954 -0.1957387 -0.0335628 0.1149694 -0.3197703 0.0011997 -0.0314832 -0.0060167 -0.0876016 1.0044623 -0.4030693 0.0166118 -0.3384794 0.5909887 -0.0055103 0.0171914 -0.0068335 0.1784799 1.4643818 0.0195947 0.0283189 0.2302357 -0.072454 0.0031249 0.0297138 -0.0017131 0.2335388 -0.5267576 0.5547697 -0.0029374 0.7357731 0.7165945 0.0236995 -0.0016126 0.0197036 -0.2353906 0.5977045 0.0059617 0.0136311 -0.1913171 -0.1843496 -0.005776 0.0121086 -0.0012907 0.0078504 -0.2648231 -0.5206777 -0.0043453 -1.0156137 0.69318 -0.0171777 -0.008098 -0.0056837 -0.2208746 2.5601006 0.2251408 0.0545407 0.3633253 1.2915303 0.0158412 0.0544828 0.0125672 0.2518745 0.1341843 -0.0384646 -0.0008482 -0.0144697 0.0426999 -0.0011317 -0.0006082 -0.0015959 0.1589324 0.3013365 0.0240708 -0.0012671 -0.042013 0.2287392 -0.0020221 -0.0016394 -0.0005104 0.3643167 0.2923738 -0.0164292 -0.0016189 0.0531413 0.2098716 0.0002077 -0.00116 -0.0013528 0.3591402 0.5248735 0.0733201 0.0040854 -0.0302747 0.4564904 -0.0003236 0.0032322 0.0018864 0.3661376 0.2605017 0.0929739 -0.0025895 0.1915334 0.3164562 0.0037458 -0.0018101 0.0016192 0.4048933 unknown
polarizability: 191.8525147|-3.885238|170.6646829|3.3696793|0.7652203|44.7109356 unknown
InChI: InChI=1S/C7H5Br2NO3/c8-3-1-2(7(12)13)6(11)4(9)5(3)10/h1,11-12H,10H2
charge 0 multiplicity 1
18 atoms
Br 1.829397 2.900408 0.029939
Br 2.322262 -2.927042 0.001562
O  -1.141278 2.178418 -0.044837
O  -2.974788 -1.647537 -0.112232
O  -3.232259 0.656194 -0.101442
N  3.228216 0.088095 0.04245
C  -0.999346 -0.27651 -0.057648
C  -0.389597 1.031346 -0.034693
C  1.859698 -0.023012 0.010319
C  1.017117 1.128073 -0.001221
C  -0.173624 -1.433939 -0.046312
C  1.209247 -1.307196 -0.01333
C  -2.451391 -0.359551 -0.091624
H  -0.648383 -2.417643 -0.063945
H  3.809279 -0.748172 0.04964
H  3.661737 1.009887 0.058776
H  -2.12769 1.904129 -0.070146
H  -3.967396 -1.591547 -0.134057
